program: Orca
programVersion: 5.0.2
elementType: O O N C C C C C C C C C C C C C C C C C C C H H H H H H H H H H H H H H H H H
charge: 0
multiplicity: 1
keywords: wb97x-d3
keywords: def2-TZVPP
keywords: def2/J RIJCOSX
keywords: DEFGRID2
keywords: scfconv7
keywords: smallprint printgap noloewdin
keywords: NOSOSCF
formula: C19H17NO2
InChI: InChI=1/C19H17NO2/c1-14(19(21)20-17-9-3-2-4-10-17)22-18-12-11-15-7-5-6-8-16(15)13-18/h2-14,20H,1H3
39 atoms
O  0.292945 -2.016521 -0.58155
O  -2.432782 -1.688146 1.658261
N  -1.997987 -0.582888 -0.290556
C  -0.689313 -2.550262 0.284362
C  3.208053 0.142613 -0.582165
C  3.16876 0.700227 0.722808
C  1.213947 -1.138478 -0.10517
C  2.214936 -0.77714 -0.972673
C  2.131486 0.301351 1.590868
C  1.175217 -0.595655 1.198938
C  -1.793005 -1.546787 0.631438
C  -1.297723 -3.755008 -0.413672
C  4.253099 0.530022 -1.456574
C  4.162098 1.629621 1.110465
C  5.200941 1.428417 -1.052501
C  5.155894 1.987688 0.242841
C  -2.925517 0.466932 -0.284048
C  -3.876807 0.673781 0.715091
C  -2.870106 1.353167 -1.363149
C  -4.74602 1.75315 0.619415
C  -3.744874 2.421695 -1.445497
C  -4.691684 2.631276 -0.451092
H  -0.242373 -2.874605 1.229935
H  2.242913 -1.201774 -1.969638
H  0.405632 -0.871373 1.907096
H  -1.762985 -3.478221 -1.360397
H  -2.056044 -4.209826 0.221811
H  -0.529849 -4.503894 -0.607193
H  4.291354 0.10324 -2.451648
H  4.121927 2.054912 2.106324
H  -1.405809 -0.613577 -1.109638
H  5.995298 1.716069 -1.729409
H  5.912496 2.70023 0.544575
H  -3.953138 0.012813 1.562205
H  -2.132252 1.201894 -2.143014
H  -5.477686 1.902062 1.403235
H  -3.682186 3.093465 -2.291787
H  -5.376052 3.467158 -0.511343
H  2.091334 0.715756 2.590895
elementType: O N C H
totalener: -939.57829385 hartree
nucrepener: 1649.92935357 hartree
electener: -2589.50764741 hartree
oneelecener: -4551.35397965 hartree
twoeener: 1961.84633223 hartree
cpcmener: -0.02689120 hartree
kineticenergy: 935.40951305 hartree
xcener: -92.099304225854 hartree
chargesum: -0.0000000
charge: -0.337067 -0.491814 -0.113260 0.158366 -0.044792 -0.051765 0.281526 -0.191479 -0.172336 -0.140251 0.294192 -0.269743 -0.154740 -0.112746 -0.138596 -0.169863 0.211888 -0.250840 -0.235005 -0.130486 -0.112595 -0.197313 0.112830 0.126714 0.135785 0.103801 0.104157 0.103258 0.141615 0.143452 0.174986 0.156045 0.155608 0.156236 0.138450 0.155960 0.157626 0.157186 0.145010
qa: -0.3371 -0.4918 -0.1133 0.1584 -0.0448 -0.0518 0.2815 -0.1915 -0.1723 -0.1403 0.2942 -0.2697 -0.1547 -0.1127 -0.1386 -0.1699 0.2119 -0.2508 -0.2350 -0.1305 -0.1126 -0.1973 0.1128 0.1267 0.1358 0.1038 0.1042 0.1033 0.1416 0.1435 0.1750 0.1560 0.1556 0.1562 0.1385 0.1560 0.1576 0.1572 0.1450
va: 2.0493 2.0237 3.2611 3.7992 3.9023 3.8443 3.8207 4.0209 3.9802 3.8437 4.0539 3.9438 3.9068 3.8909 3.8961 3.9086 3.7580 3.9662 3.9564 3.9133 3.8930 3.9236 1.0137 1.0234 1.0239 1.0044 1.0100 1.0079 1.0062 1.0048 1.0202 0.9902 0.9913 1.0405 1.0092 0.9924 0.9902 0.9911 1.0057
dispcorr: -0.016581296 hartree
energy: -939.594875144354
dipole: -1.46315 2.03187 0.56872 -0.77941 1.00424 0.22483 -2.34425 1.22380 -1.12046
magnitude: 1.27648 au
magnitude: 3.24456 debye
