program: Orca
programVersion: 5.0.2
elementType: O O N C C C C C C C C C C C C C C C C C C C H H H H H H H H H H H H H H H H H
charge: 0
multiplicity: 1
keywords: wb97x-d3
keywords: def2-TZVPP
keywords: def2/J RIJCOSX
keywords: DEFGRID2
keywords: scfconv7
keywords: smallprint printgap noloewdin
keywords: NOSOSCF
formula: C19H17NO2
InChI: InChI=1/C19H17NO2/c1-14(19(21)20-17-9-3-2-4-10-17)22-18-12-11-15-7-5-6-8-16(15)13-18/h2-14,20H,1H3
39 atoms
O  0.34461 -2.223913 0.641776
O  -2.458261 -1.876816 -1.489797
N  -1.898725 -0.70624 0.385306
C  -0.710126 -2.761388 -0.133188
C  2.975021 0.271892 0.534525
C  2.925773 0.704557 -0.815784
C  1.170893 -1.283876 0.115467
C  2.082388 -0.724711 0.976747
C  1.983828 0.103267 -1.676319
C  1.126383 -0.867957 -1.234842
C  -1.776648 -1.722568 -0.49194
C  -1.332035 -3.884121 0.678765
C  3.920503 0.867159 1.405537
C  3.813548 1.715352 -1.253858
C  4.767603 1.840071 0.953192
C  4.714887 2.271939 -0.389849
C  -2.693938 0.443644 0.307386
C  -2.475259 1.411807 1.290572
C  -3.656141 0.678229 -0.67475
C  -3.192345 2.594362 1.291067
C  -4.365681 1.873074 -0.662827
C  -4.143995 2.836344 0.308734
H  2.114439 -1.045593 2.011646
H  1.936961 0.418741 -2.711549
H  0.430822 -1.29939 -1.941818
H  -2.149145 -4.338833 0.120625
H  -1.725862 -3.52165 1.629133
H  -0.592459 -4.659207 0.880082
H  3.963302 0.541676 2.437893
H  3.766988 2.042857 -2.285602
H  -1.289545 -0.734367 1.1915
H  5.485673 2.286918 1.628901
H  5.391112 3.044887 -0.730964
H  -1.727185 1.236373 2.055285
H  -3.862263 -0.045446 -1.44605
H  -2.999059 3.329508 2.061425
H  -5.106645 2.04522 -1.433091
H  -4.703119 3.762641 0.302219
H  -0.33482 -3.170843 -1.076905
elementType: O N C H
totalener: -939.57761997 hartree
nucrepener: 1668.88736030 hartree
electener: -2608.46498027 hartree
oneelecener: -4589.30932271 hartree
twoeener: 1980.84434245 hartree
cpcmener: -0.02724475 hartree
kineticenergy: 935.41539020 hartree
xcener: -92.100424806318 hartree
chargesum: 0.0000000
charge: -0.331480 -0.490610 -0.112905 0.164063 -0.039364 -0.057152 0.253535 -0.181646 -0.155617 -0.146383 0.287184 -0.272305 -0.153226 -0.111880 -0.140060 -0.169201 0.215599 -0.232698 -0.254087 -0.111870 -0.128213 -0.197763 0.125692 0.145515 0.135910 0.104117 0.102800 0.104241 0.141328 0.143170 0.176380 0.156406 0.155828 0.136851 0.154859 0.157126 0.156272 0.157223 0.112360
qa: -0.3315 -0.4906 -0.1129 0.1641 -0.0394 -0.0572 0.2535 -0.1816 -0.1556 -0.1464 0.2872 -0.2723 -0.1532 -0.1119 -0.1401 -0.1692 0.2156 -0.2327 -0.2541 -0.1119 -0.1282 -0.1978 0.1257 0.1455 0.1359 0.1041 0.1028 0.1042 0.1413 0.1432 0.1764 0.1564 0.1558 0.1369 0.1549 0.1571 0.1563 0.1572 0.1124
va: 2.0584 2.0241 3.2554 3.7890 3.8927 3.8469 3.8371 3.9946 3.9678 3.8414 4.0618 3.9463 3.9054 3.8927 3.8956 3.9080 3.7442 3.9539 3.9757 3.8931 3.9092 3.9233 1.0242 1.0050 1.0226 1.0094 1.0045 1.0070 1.0062 1.0050 1.0178 0.9901 0.9912 1.0102 1.0403 0.9905 0.9920 0.9911 1.0110
dispcorr: -0.017039738 hartree
energy: -939.594659706969
dipole: -1.34761 1.94619 0.59858 -0.21206 0.50456 0.29250 2.46684 -1.37847 1.08837
magnitude: 1.27609 au
magnitude: 3.24355 debye
