program: Orca
programVersion: 5.0.2
elementType: O O N C C C C C C C C C C C C C C C C C C C H H H H H H H H H H H H H H H H H
charge: 0
multiplicity: 1
keywords: wb97x-d3
keywords: def2-TZVPP
keywords: def2/J RIJCOSX
keywords: DEFGRID2
keywords: scfconv7
keywords: smallprint printgap noloewdin
keywords: NOSOSCF
formula: C19H17NO2
InChI: InChI=1/C19H17NO2/c1-14(19(21)20-17-9-3-2-4-10-17)22-18-12-11-15-7-5-6-8-16(15)13-18/h2-14,20H,1H3
39 atoms
O  0.201054 -2.321094 0.611529
O  -1.943912 -1.264094 -1.99327
N  -1.922621 -0.675845 0.211638
C  -0.606731 -2.57861 -0.520648
C  2.545577 0.294623 -0.529267
C  3.292376 0.460899 0.663301
C  1.193075 -1.400192 0.530141
C  1.491712 -0.651471 -0.578053
C  2.957297 -0.337619 1.783295
C  1.939726 -1.241679 1.722986
C  -1.553328 -1.420708 -0.849913
C  -1.411393 -3.831321 -0.225199
C  2.872257 1.090762 -1.651321
C  4.336929 1.411005 0.701613
C  3.889465 2.004643 -1.58686
C  4.631463 2.167942 -0.400116
C  -2.719053 0.474142 0.259525
C  -2.787702 1.128573 1.491877
C  -3.426333 0.991461 -0.825726
C  -3.539344 2.28016 1.63833
C  -4.173309 2.151152 -0.663401
C  -4.236077 2.804444 0.557359
H  0.948401 -0.747433 -1.509747
H  3.522358 -0.224262 2.70061
H  1.689714 -1.848931 2.584072
H  -2.035214 -4.083588 -1.08167
H  -2.058635 -3.699156 0.642279
H  -0.745489 -4.67317 -0.038497
H  2.303044 0.970274 -2.565255
H  4.903205 1.531752 1.617579
H  -1.524351 -0.943902 1.101636
H  4.127997 2.608814 -2.452751
H  5.433024 2.894202 -0.36394
H  -2.241582 0.731727 2.340384
H  -3.406682 0.508706 -1.788938
H  -3.57477 2.771238 2.602226
H  -4.714519 2.544289 -1.514623
H  -4.819068 3.709155 0.666893
H  0.012493 -2.748461 -1.407922
elementType: O N C H
totalener: -939.58010758 hartree
nucrepener: 1670.39319865 hartree
electener: -2609.97330623 hartree
oneelecener: -4592.40702554 hartree
twoeener: 1982.43371931 hartree
cpcmener: -0.02721736 hartree
kineticenergy: 935.41680825 hartree
xcener: -92.100497130893 hartree
chargesum: 0.0000000
charge: -0.336289 -0.491389 -0.116153 0.167067 -0.091056 -0.126415 0.276607 -0.051905 -0.101548 -0.224824 0.290154 -0.272336 -0.156202 -0.100890 -0.151244 -0.158222 0.215025 -0.236046 -0.251438 -0.111587 -0.128749 -0.198890 0.115595 0.143308 0.139396 0.105049 0.103653 0.103909 0.140072 0.142372 0.175705 0.154848 0.155868 0.138486 0.154378 0.157044 0.156978 0.157522 0.112150
qa: -0.3363 -0.4914 -0.1162 0.1671 -0.0911 -0.1264 0.2766 -0.0519 -0.1015 -0.2248 0.2902 -0.2723 -0.1562 -0.1009 -0.1512 -0.1582 0.2150 -0.2360 -0.2514 -0.1116 -0.1287 -0.1989 0.1156 0.1433 0.1394 0.1050 0.1037 0.1039 0.1401 0.1424 0.1757 0.1548 0.1559 0.1385 0.1544 0.1570 0.1570 0.1575 0.1121
va: 2.0648 2.0225 3.2575 3.7846 3.9163 3.9075 3.7859 3.6983 3.9381 4.0224 4.0565 3.9438 3.9154 3.8801 3.9071 3.9018 3.7468 3.9559 3.9727 3.8930 3.9098 3.9237 1.0395 1.0021 1.0117 1.0089 1.0044 1.0077 1.0091 1.0048 1.0197 0.9926 0.9914 1.0092 1.0404 0.9905 0.9919 0.9911 1.0153
dispcorr: -0.016909741 hartree
energy: -939.597017321361
dipole: -2.04870 2.37579 0.32709 -0.82815 0.67508 -0.15308 1.38353 0.09820 1.48174
magnitude: 1.52511 au
magnitude: 3.87652 debye
