program: Orca
programVersion: 5.0.2
elementType: O O N C C C C C C C C C C C C C C C C C C C H H H H H H H H H H H H H H H H H
charge: 0
multiplicity: 1
keywords: wb97x-d3
keywords: def2-TZVPP
keywords: def2/J RIJCOSX
keywords: DEFGRID2
keywords: scfconv7
keywords: smallprint printgap noloewdin
keywords: NOSOSCF
formula: C19H17NO2
InChI: InChI=1/C19H17NO2/c1-14(19(21)20-17-9-3-2-4-10-17)22-18-12-11-15-7-5-6-8-16(15)13-18/h2-14,20H,1H3
39 atoms
O  0.192569 -2.285395 0.636375
O  -1.941576 -1.25102 -1.989313
N  -1.937723 -0.645598 0.211564
C  -0.60321 -2.546504 -0.502694
C  2.576978 0.292175 -0.507506
C  3.36502 0.403854 0.665318
C  1.209843 -1.392576 0.548694
C  1.496499 -0.62296 -0.548333
C  3.0441 -0.418262 1.772181
C  1.99833 -1.29014 1.720445
C  -1.556293 -1.396444 -0.842613
C  -1.398936 -3.808598 -0.218938
C  2.887519 1.113383 -1.615782
C  4.432262 1.328347 0.6979
C  3.92602 2.003357 -1.556083
C  4.707729 2.113789 -0.388958
C  -2.769202 0.480777 0.244728
C  -3.436066 1.002352 -0.86398
C  -2.918024 1.108581 1.484131
C  -4.227679 2.13408 -0.716529
C  -3.713368 2.232811 1.61545
C  -4.37479 2.757115 0.512492
H  0.922156 -0.679104 -1.464505
H  3.642738 -0.349342 2.672405
H  1.757658 -1.915029 2.571656
H  -2.025724 -4.054926 -1.074788
H  -2.041198 -3.690877 0.654401
H  -0.724704 -4.647138 -0.046295
H  2.287743 1.032108 -2.514558
H  5.029888 1.408216 1.598374
H  -1.551255 -0.907372 1.108711
H  4.149987 2.629758 -2.410092
H  5.524741 2.82279 -0.35555
H  -3.349004 0.545245 -1.835589
H  -2.401636 0.712326 2.35134
H  -4.736338 2.528985 -1.586773
H  -3.812755 2.701221 2.586179
H  -4.99516 3.638092 0.611245
H  0.02642 -2.70928 -1.384185
elementType: O N C H
totalener: -939.58026574 hartree
nucrepener: 1665.60856739 hartree
electener: -2605.18883313 hartree
oneelecener: -4582.83049145 hartree
twoeener: 1977.64165832 hartree
cpcmener: -0.02701430 hartree
kineticenergy: 935.40846028 hartree
xcener: -92.098994199803 hartree
chargesum: -0.0000000
charge: -0.338183 -0.491494 -0.114807 0.164028 -0.100280 -0.123103 0.284648 -0.047597 -0.104183 -0.225629 0.294010 -0.271010 -0.156171 -0.101473 -0.152110 -0.157746 0.212424 -0.249729 -0.237296 -0.130102 -0.111807 -0.198669 0.115778 0.143027 0.139627 0.104798 0.103628 0.103926 0.140173 0.142265 0.175150 0.154732 0.155756 0.155422 0.138953 0.156603 0.157276 0.157468 0.111697
qa: -0.3382 -0.4915 -0.1148 0.1640 -0.1003 -0.1231 0.2846 -0.0476 -0.1042 -0.2256 0.2940 -0.2710 -0.1562 -0.1015 -0.1521 -0.1577 0.2124 -0.2497 -0.2373 -0.1301 -0.1118 -0.1987 0.1158 0.1430 0.1396 0.1048 0.1036 0.1039 0.1402 0.1423 0.1752 0.1547 0.1558 0.1554 0.1390 0.1566 0.1573 0.1575 0.1117
va: 2.0617 2.0226 3.2609 3.7896 3.9216 3.9048 3.7807 3.6947 3.9406 4.0259 4.0518 3.9430 3.9149 3.8806 3.9084 3.9010 3.7566 3.9661 3.9565 3.9114 3.8930 3.9246 1.0397 1.0022 1.0115 1.0092 1.0044 1.0076 1.0091 1.0048 1.0200 0.9927 0.9914 1.0409 1.0088 0.9921 0.9904 0.9911 1.0163
dispcorr: -0.016780235 hartree
energy: -939.597045978409
dipole: -2.10175 2.42139 0.31965 -0.90160 0.74473 -0.15687 1.32613 0.15354 1.47967
magnitude: 1.52191 au
magnitude: 3.86838 debye
