program: Orca
programVersion: 5.0.2
elementType: O O N C C C C C C C C C C C C C C C C C C C H H H H H H H H H H H H H H H H H
charge: 0
multiplicity: 1
keywords: wb97x-d3
keywords: def2-TZVPP
keywords: def2/J RIJCOSX
keywords: DEFGRID2
keywords: scfconv7
keywords: smallprint printgap noloewdin
keywords: NOSOSCF
formula: C19H17NO2
InChI: InChI=1/C19H17NO2/c1-14(19(21)20-17-9-3-2-4-10-17)22-18-12-11-15-7-5-6-8-16(15)13-18/h2-14,20H,1H3
39 atoms
O  0.074958 -0.29919 0.042028
O  -2.849104 -2.076218 -0.818974
N  -2.477666 0.011069 0.03327
C  -0.597362 -1.465164 -0.411524
C  3.647639 0.177194 0.616431
C  4.14786 0.131436 -0.709109
C  1.410855 -0.195783 -0.209509
C  2.264892 -0.003452 0.840104
C  3.236789 -0.075913 -1.768843
C  1.900738 -0.228815 -1.533879
C  -2.10466 -1.207052 -0.422606
C  -0.267824 -2.670902 0.452956
C  4.553585 0.396407 1.678979
C  5.532091 0.304857 -0.930344
C  5.887766 0.563869 1.434604
C  6.384258 0.517404 0.116618
C  -3.761523 0.549566 0.16367
C  -4.931131 -0.124089 -0.185815
C  -3.849199 1.843304 0.679919
C  -6.154973 0.505126 -0.013151
C  -5.07724 2.45618 0.845903
C  -6.24285 1.789198 0.49993
H  1.875797 0.020538 1.850716
H  3.609233 -0.097453 -2.785578
H  1.217343 -0.352916 -2.364193
H  -0.558321 -2.501058 1.48978
H  0.801455 -2.881657 0.425439
H  -0.796258 -3.548077 0.086621
H  4.17527 0.432373 2.69319
H  5.909635 0.26914 -1.944985
H  -1.719941 0.613432 0.315083
H  6.570797 0.734375 2.256188
H  7.442499 0.652452 -0.062471
H  -4.890104 -1.12334 -0.586112
H  -2.945599 2.375937 0.95467
H  -7.055834 -0.027428 -0.288435
H  -5.120686 3.459737 1.247783
H  -7.205447 2.265176 0.627975
H  -0.323531 -1.684162 -1.450406
totalener: -939.55286025 hartree
nucrepener: 1601.73595172 hartree
electener: -2541.28881198 hartree
oneelecener: -4454.46369614 hartree
twoeener: 1913.17488417 hartree
kineticenergy: 935.47033833 hartree
xcener: -92.106658388242 hartree
chargesum: -0.0000000
charge: -0.362851 -0.411965 -0.148406 0.141599 -0.030540 -0.047972 0.177688 -0.094778 -0.098661 -0.136856 0.301280 -0.268267 -0.114317 -0.078717 -0.106812 -0.129309 0.221887 -0.207745 -0.221527 -0.091954 -0.092659 -0.162160 0.108672 0.113549 0.127406 0.088577 0.096984 0.116814 0.110516 0.110278 0.146793 0.124979 0.124563 0.150935 0.097950 0.124892 0.122535 0.123631 0.073971
qa: -0.3629 -0.4120 -0.1484 0.1416 -0.0305 -0.0480 0.1777 -0.0948 -0.0987 -0.1369 0.3013 -0.2683 -0.1143 -0.0787 -0.1068 -0.1293 0.2219 -0.2077 -0.2215 -0.0920 -0.0927 -0.1622 0.1087 0.1135 0.1274 0.0886 0.0970 0.1168 0.1105 0.1103 0.1468 0.1250 0.1246 0.1509 0.0980 0.1249 0.1225 0.1236 0.0740
va: 1.9659 2.1075 3.2424 3.9074 3.9343 3.9436 3.8907 3.9921 3.9897 4.0115 4.1905 3.9083 3.9529 3.9419 3.9575 3.9740 3.8303 4.0061 4.0148 3.9414 3.9813 3.9815 1.0237 1.0127 1.0054 1.0106 1.0028 1.0220 1.0135 1.0131 1.0559 1.0001 1.0011 1.0404 1.0180 1.0010 1.0007 1.0009 1.0162
dispcorr: -0.015803170 hartree
energy: -939.568663423635
dipole: 1.21474 -0.10579 1.10895 -1.33877 1.91987 0.58110 2.06755 -1.83272 0.23482
magnitude: 1.27381 au
magnitude: 3.23776 debye
