program: Orca
programVersion: 5.0.2
elementType: P O O O O N C C C H H H H H H H H
charge: 0
multiplicity: 1
keywords: wb97x-d3
keywords: def2-TZVPP
keywords: def2/J RIJCOSX
keywords: DEFGRID2
keywords: scfconv7
keywords: smallprint printgap noloewdin
keywords: NOSOSCF
formula: C3H8NO4P
InChI: InChI=1/C3H8NO4P/c1-2-8-9(6,7)3(4)5/h6H,2,4H2,1H3
17 atoms
P  0.182704 -0.428494 -0.307573
O  -0.986542 -0.140406 0.734151
O  -0.149694 -0.18065 -1.731749
O  0.66849 -1.889061 0.102549
O  1.313811 1.836605 0.39862
N  2.74489 0.080257 0.501565
C  -1.935445 0.9347 0.543213
C  -3.208997 0.421538 -0.077758
C  1.564798 0.643842 0.282706
H  -2.118426 1.339584 1.537357
H  -1.501494 1.731934 -0.061532
H  -3.040572 0.045412 -1.086538
H  -3.655968 -0.371136 0.521922
H  -3.92894 1.237865 -0.141013
H  3.530159 0.650228 0.78471
H  0.279186 -2.615519 -0.408389
H  2.89903 -0.909353 0.39236
elementType: P O N C H
totalener: -816.35094634 hartree
nucrepener: 608.97048110 hartree
electener: -1425.32142744 hartree
oneelecener: -2332.68028728 hartree
twoeener: 907.35885984 hartree
cpcmener: -0.04698828 hartree
kineticenergy: 813.59828131 hartree
xcener: -59.481133579223 hartree
chargesum: -0.0000000
charge: 0.869155 -0.360415 -0.650257 -0.387960 -0.508988 -0.198687 0.054792 -0.245104 0.264011 0.109201 0.092335 0.079222 0.088390 0.095124 0.205453 0.281980 0.211748
qa: 0.8692 -0.3604 -0.6503 -0.3880 -0.5090 -0.1987 0.0548 -0.2451 0.2640 0.1092 0.0923 0.0792 0.0884 0.0951 0.2055 0.2820 0.2117
va: 5.2643 2.0580 1.9197 2.1595 1.9843 3.2851 3.8389 3.9397 4.1936 0.9927 1.0079 1.0166 1.0040 1.0082 0.9974 0.9791 0.9970
dispcorr: -0.005571022 hartree
energy: -816.356517361800
dipole: -7.51420 8.22083 0.70664 1.11217 -2.97767 -1.86551 1.70989 -0.64768 1.06221
magnitude: 2.26003 au
magnitude: 5.74454 debye
