program: Orca
programVersion: 5.0.2
elementType: P O O O O N C C C H H H H H H H H
charge: 0
multiplicity: 1
keywords: wb97x-d3
keywords: def2-TZVPP
keywords: def2/J RIJCOSX
keywords: DEFGRID2
keywords: scfconv7
keywords: smallprint printgap noloewdin
keywords: NOSOSCF
formula: C3H8NO4P
InChI: InChI=1/C3H8NO4P/c1-2-8-9(6,7)3(4)5/h6H,2,4H2,1H3
17 atoms
P  0.120481 -0.292054 -0.212296
O  -0.974631 0.753926 0.283855
O  -0.063178 -0.85857 -1.569889
O  0.224421 -1.44902 0.883387
O  1.978107 1.007739 1.184793
N  2.26231 1.101516 -1.067738
C  -2.362165 0.645998 -0.111481
C  -3.047283 -0.565171 0.473069
C  1.642423 0.728804 0.043387
H  -2.823608 1.562923 0.249196
H  -2.42629 0.646012 -1.200712
H  -2.962834 -0.590473 1.559076
H  -4.106964 -0.521397 0.221075
H  -2.65653 -1.498966 0.068062
H  3.099653 1.665138 -1.020841
H  0.303994 -1.155621 1.80347
H  1.938346 0.813079 -1.97813
elementType: P O N C H
totalener: -816.35194462 hartree
nucrepener: 609.72176678 hartree
electener: -1426.07371140 hartree
oneelecener: -2333.87475575 hartree
twoeener: 907.80104434 hartree
cpcmener: -0.04246588 hartree
kineticenergy: 813.59742392 hartree
xcener: -59.480526846831 hartree
chargesum: 0.0000000
charge: 0.886952 -0.355068 -0.661271 -0.389498 -0.499111 -0.191298 0.040349 -0.248374 0.237067 0.108471 0.100047 0.092269 0.097901 0.086623 0.206056 0.277271 0.211615
qa: 0.8870 -0.3551 -0.6613 -0.3895 -0.4991 -0.1913 0.0403 -0.2484 0.2371 0.1085 0.1000 0.0923 0.0979 0.0866 0.2061 0.2773 0.2116
va: 5.2412 2.0842 1.9349 2.1344 1.9970 3.2736 3.8472 3.9071 4.2227 0.9902 1.0040 1.0047 1.0084 1.0135 0.9959 0.9837 0.9973
dispcorr: -0.005670956 hartree
energy: -816.357615576704
dipole: -9.07720 8.61916 -0.45805 0.76065 0.14556 0.90620 0.10935 -0.26330 -0.15394
magnitude: 1.02699 au
magnitude: 2.61040 debye
