program: Orca
programVersion: 5.0.2
elementType: P O O O O N C C C H H H H H H H H
charge: 0
multiplicity: 1
keywords: wb97x-d3
keywords: def2-TZVPP
keywords: def2/J RIJCOSX
keywords: DEFGRID2
keywords: scfconv7
keywords: smallprint printgap noloewdin
keywords: NOSOSCF
formula: C3H8NO4P
InChI: InChI=1/C3H8NO4P/c1-2-8-9(6,7)3(4)5/h6H,2,4H2,1H3
17 atoms
P  0.143099 -0.654771 0.142015
O  -1.081816 -0.186725 -0.764457
O  0.67572 -1.931022 -0.643682
O  -0.113523 -0.9350 1.572094
O  1.754528 0.906844 -1.29576
N  1.89476 1.244649 0.946739
C  -1.907948 0.939206 -0.401155
C  -3.04442 0.530854 0.503389
C  1.423801 0.658754 -0.148666
H  -1.304677 1.726706 0.060144
H  -2.284095 1.333475 -1.344032
H  -2.691949 0.196759 1.478695
H  -3.698995 1.388817 0.661722
H  -3.641615 -0.264652 0.057042
H  0.833623 -1.824758 -1.593331
H  2.602413 1.962826 0.878715
H  1.58358 0.975737 1.867224
elementType: P O N C H
totalener: -816.35213449 hartree
nucrepener: 610.72252283 hartree
electener: -1427.07465733 hartree
oneelecener: -2335.72687302 hartree
twoeener: 908.65221569 hartree
cpcmener: -0.03560646 hartree
kineticenergy: 813.59713896 hartree
xcener: -59.477939773422 hartree
chargesum: -0.0000000
charge: 0.888916 -0.352384 -0.381366 -0.631520 -0.471192 -0.188772 0.050013 -0.241369 0.180883 0.095874 0.106944 0.081588 0.093980 0.088104 0.271791 0.200030 0.208479
qa: 0.8889 -0.3524 -0.3814 -0.6315 -0.4712 -0.1888 0.0500 -0.2414 0.1809 0.0959 0.1069 0.0816 0.0940 0.0881 0.2718 0.2000 0.2085
va: 5.2986 2.0759 2.1632 1.9690 2.0309 3.2150 3.8621 3.9257 4.2185 0.9994 0.9915 1.0190 1.0087 1.0046 0.9891 0.9987 1.0009
dispcorr: -0.005751571 hartree
energy: -816.357886065511
dipole: -8.15502 8.08021 -0.07480 5.98016 -4.47626 1.50390 1.75305 -1.69262 0.06043
magnitude: 1.50697 au
magnitude: 3.83042 debye
