program: Orca
programVersion: 5.0.2
elementType: P O O O O N C C C H H H H H H H H
charge: 0
multiplicity: 1
keywords: wb97x-d3
keywords: def2-TZVPP
keywords: def2/J RIJCOSX
keywords: DEFGRID2
keywords: scfconv7
keywords: smallprint printgap noloewdin
keywords: NOSOSCF
formula: C3H8NO4P
InChI: InChI=1/C3H8NO4P/c1-2-8-9(6,7)3(4)5/h6H,2,4H2,1H3
17 atoms
P  0.096669 -0.27205 -0.258095
O  -0.996551 0.72579 0.34924
O  -0.049116 -0.650879 -1.673684
O  0.174997 -1.512535 0.758057
O  2.044982 0.667912 1.297121
N  2.225911 1.253008 -0.896878
C  -2.302713 0.299884 0.754786
C  -3.106202 -0.343762 -0.354865
C  1.644908 0.659784 0.15255
H  -2.215768 -0.378504 1.60771
H  -2.795216 1.205374 1.106614
H  -2.694374 -1.304322 -0.661789
H  -4.123443 -0.517428 -0.002251
H  -3.156417 0.298237 -1.232877
H  3.097422 1.743981 -0.781911
H  0.636036 -1.289478 1.578225
H  1.881043 1.093697 -1.828507
totalener: -816.32792894 hartree
nucrepener: 610.87909586 hartree
electener: -1427.20702480 hartree
oneelecener: -2335.81368387 hartree
twoeener: 908.60665907 hartree
kineticenergy: 813.65909213 hartree
xcener: -59.479993787603 hartree
chargesum: -0.0000000
charge: 0.781978 -0.317772 -0.527475 -0.348973 -0.385766 -0.214740 0.012855 -0.228085 0.216434 0.083540 0.092802 0.092633 0.080684 0.093947 0.165748 0.220063 0.182126
qa: 0.7820 -0.3178 -0.5275 -0.3490 -0.3858 -0.2147 0.0129 -0.2281 0.2164 0.0835 0.0928 0.0926 0.0807 0.0939 0.1657 0.2201 0.1821
va: 5.3408 2.0948 2.0996 2.1488 2.1168 3.2140 3.9180 3.9048 4.1999 1.0000 0.9874 1.0120 1.0092 1.0087 1.0229 1.0429 1.0205
dispcorr: -0.005569399 hartree
energy: -816.333498340933
dipole: -8.77421 8.62891 -0.14531 0.81655 -0.19331 0.62324 0.14168 0.05127 0.19294
magnitude: 0.66841 au
magnitude: 1.69896 debye
