program: Orca
programVersion: 5.0.2
elementType: Cl F O O O N C C C C C C C C C C C C C C C C H H H H H H H H H H H H H
charge: 0
multiplicity: 1
keywords: wb97x-d3
keywords: def2-TZVPP
keywords: def2/J RIJCOSX
keywords: DEFGRID2
keywords: scfconv7
keywords: smallprint printgap noloewdin
keywords: NOSOSCF
formula: C16H13ClFNO3
InChI: InChI=1/C16H13ClFNO3/c1-10(16(21)22)19(12-7-8-14(18)13(17)9-12)15(20)11-5-3-2-4-6-11/h2-10,21H,1H3
35 atoms
Cl -3.107172 1.362057 -2.1750
F  -3.376992 2.973936 0.213791
O  2.468364 -1.74144 -0.368931
O  4.86892 0.486654 0.39405
O  3.372108 -0.032549 1.965585
N  1.360229 0.169802 0.054171
C  2.593397 0.936479 -0.091506
C  0.140871 0.891671 0.093385
C  1.418203 -1.178211 -0.086529
C  3.017077 1.103157 -1.543063
C  0.176284 -1.964704 0.152572
C  3.637991 0.38355 0.864097
C  -0.762552 0.783635 -0.95569
C  -0.133534 1.726597 1.169495
C  -1.95534 1.48473 -0.9024
C  -1.318383 2.441124 1.212081
C  -0.582689 -1.792808 1.306944
C  -0.175582 -2.946839 -0.768461
C  -2.224033 2.305764 0.179557
C  -1.693677 -2.591409 1.529517
C  -1.30159 -3.727094 -0.553414
C  -2.061261 -3.550918 0.59541
H  2.380474 1.935312 0.302718
H  3.337017 0.170334 -2.001601
H  2.174644 1.493977 -2.114116
H  3.824686 1.828205 -1.627997
H  -0.543194 0.152111 -1.806543
H  0.572788 1.807971 1.985531
H  -1.545603 3.08926 2.047997
H  -0.303007 -1.051126 2.043617
H  0.417902 -3.090465 -1.66241
H  -2.274799 -2.461427 2.432688
H  -1.582812 -4.476131 -1.281668
H  -2.936005 -4.16473 0.765203
H  5.507395 0.185642 1.060111
elementType: Cl F O N C H
totalener: -1458.15223244 hartree
nucrepener: 1945.50768577 hartree
electener: -3403.65991821 hartree
oneelecener: -5864.94745162 hartree
twoeener: 2461.28753341 hartree
cpcmener: -0.04567828 hartree
kineticenergy: 1453.42141488 hartree
xcener: -114.597208590120 hartree
chargesum: -0.0000000
charge: -0.069140 -0.204248 -0.525188 -0.285823 -0.469332 0.008283 0.102321 0.026797 0.485453 -0.304409 -0.048415 0.409929 -0.191334 -0.230102 0.076900 -0.115905 -0.180430 -0.177243 0.238599 -0.175249 -0.187877 -0.120866 0.119508 0.102237 0.105531 0.109996 0.137933 0.152916 0.156146 0.159364 0.146469 0.160963 0.160367 0.163474 0.262375
qa: -0.0691 -0.2042 -0.5252 -0.2858 -0.4693 0.0083 0.1023 0.0268 0.4855 -0.3044 -0.0484 0.4099 -0.1913 -0.2301 0.0769 -0.1159 -0.1804 -0.1772 0.2386 -0.1752 -0.1879 -0.1209 0.1195 0.1022 0.1055 0.1100 0.1379 0.1529 0.1561 0.1594 0.1465 0.1610 0.1604 0.1635 0.2624
va: 1.2339 1.0933 1.9715 2.2154 2.0170 3.0019 3.7286 3.6966 3.9395 3.9600 3.5370 4.2040 4.0494 3.9665 3.8130 3.8513 3.9243 3.9648 4.0464 3.9237 3.9330 3.8722 1.0037 1.0155 0.9988 1.0077 1.0255 1.0160 0.9951 1.0013 1.0155 0.9918 0.9919 0.9876 0.9905
dispcorr: -0.019684365 hartree
energy: -1458.171916809873
dipole: 15.61186 -15.73874 -0.12688 -9.31966 10.71035 1.39069 3.31505 -3.21615 0.09890
magnitude: 1.39996 au
magnitude: 3.55841 debye
