program: Orca
programVersion: 5.0.2
elementType: Cl F O O O N C C C C C C C C C C C C C C C C H H H H H H H H H H H H H
charge: 0
multiplicity: 1
keywords: wb97x-d3
keywords: def2-TZVPP
keywords: def2/J RIJCOSX
keywords: DEFGRID2
keywords: scfconv7
keywords: smallprint printgap noloewdin
keywords: NOSOSCF
formula: C16H13ClFNO3
InChI: InChI=1/C16H13ClFNO3/c1-10(16(21)22)19(12-7-8-14(18)13(17)9-12)15(20)11-5-3-2-4-6-11/h2-10,21H,1H3
35 atoms
Cl -2.510276 2.934013 1.836386
F  -3.499066 2.701544 -0.877732
O  2.553183 -1.79774 -0.409811
O  4.504998 0.438806 1.145463
O  2.742522 -0.379204 2.243316
N  1.205562 -0.035396 -0.054672
C  2.370734 0.811038 0.18955
C  -0.031069 0.622875 -0.269531
C  1.417619 -1.343964 -0.344528
C  3.097969 1.19634 -1.089981
C  0.238777 -2.232724 -0.54176
C  3.213833 0.196572 1.29306
C  -0.606631 1.331976 0.777866
C  -0.635942 0.609262 -1.519042
C  -1.777835 2.035178 0.565277
C  -1.821599 1.296082 -1.723927
C  -0.820925 -2.260009 0.36105
C  0.259042 -3.124749 -1.610854
C  -2.376157 2.011015 -0.684071
C  -1.855355 -3.166765 0.186289
C  -0.789688 -4.012272 -1.79561
C  -1.846623 -4.036724 -0.895757
H  1.990141 1.73474 0.636863
H  3.830142 1.977789 -0.896286
H  3.602072 0.356276 -1.561375
H  2.37552 1.603207 -1.797658
H  -0.140712 1.334529 1.754823
H  -0.183857 0.068066 -2.339146
H  -2.303541 1.293194 -2.692232
H  -0.836474 -1.593234 1.213183
H  1.085483 -3.116016 -2.309853
H  -2.669427 -3.194076 0.898176
H  -0.777637 -4.690331 -2.638523
H  -2.660035 -4.736613 -1.034923
H  4.999666 0.096151 1.907289
elementType: Cl F O N C H
totalener: -1458.15225628 hartree
nucrepener: 1933.31306177 hartree
electener: -3391.46531805 hartree
oneelecener: -5840.43910430 hartree
twoeener: 2448.97378625 hartree
cpcmener: -0.04542508 hartree
kineticenergy: 1453.42842839 hartree
xcener: -114.598671244106 hartree
chargesum: -0.0000000
charge: -0.069507 -0.204206 -0.524523 -0.286399 -0.469306 0.004475 0.099525 0.029513 0.495303 -0.303207 -0.066540 0.409939 -0.226691 -0.204756 0.101095 -0.134774 -0.175517 -0.169677 0.248091 -0.177457 -0.191804 -0.116419 0.119087 0.110495 0.102085 0.105499 0.136581 0.153905 0.154473 0.158858 0.145200 0.160741 0.160434 0.163538 0.261949
qa: -0.0695 -0.2042 -0.5245 -0.2864 -0.4693 0.0045 0.0995 0.0295 0.4953 -0.3032 -0.0665 0.4099 -0.2267 -0.2048 0.1011 -0.1348 -0.1755 -0.1697 0.2481 -0.1775 -0.1918 -0.1164 0.1191 0.1105 0.1021 0.1055 0.1366 0.1539 0.1545 0.1589 0.1452 0.1607 0.1604 0.1635 0.2619
va: 1.2327 1.0933 1.9718 2.2147 2.0178 3.0016 3.7306 3.6903 3.9270 3.9603 3.5453 4.2097 4.0767 3.9511 3.7810 3.8730 3.9188 3.9615 4.0424 3.9213 3.9371 3.8712 1.0032 1.0079 1.0154 0.9990 1.0350 1.0057 0.9966 1.0003 1.0169 0.9918 0.9921 0.9875 0.9909
dispcorr: -0.019366945 hartree
energy: -1458.171623225864
dipole: 14.46719 -14.78415 -0.31696 -14.69802 15.54739 0.84937 -9.95362 8.74342 -1.21020
magnitude: 1.51211 au
magnitude: 3.84349 debye
