program: Orca
programVersion: 5.0.2
elementType: Cl F O O O N C C C C C C C C C C C C C C C C H H H H H H H H H H H H H
charge: 0
multiplicity: 1
keywords: wb97x-d3
keywords: def2-TZVPP
keywords: def2/J RIJCOSX
keywords: DEFGRID2
keywords: scfconv7
keywords: smallprint printgap noloewdin
keywords: NOSOSCF
formula: C16H13ClFNO3
InChI: InChI=1/C16H13ClFNO3/c1-10(16(21)22)19(12-7-8-14(18)13(17)9-12)15(20)11-5-3-2-4-6-11/h2-10,21H,1H3
35 atoms
Cl -2.222217 2.228544 -2.099257
F  -3.461486 2.642255 0.493872
O  2.423051 -1.998392 0.152749
O  4.629854 0.732107 0.059389
O  2.862213 0.699002 -1.303636
N  1.263166 -0.180262 0.799271
C  2.52867 0.488158 1.083317
C  0.048341 0.554502 0.72353
C  1.34547 -1.454395 0.331116
C  2.358473 1.864968 1.71601
C  0.068478 -2.172487 0.050765
C  3.33565 0.62982 -0.19865
C  -0.418243 0.988596 -0.510356
C  -0.671646 0.834412 1.877211
C  -1.611175 1.687287 -0.583983
C  -1.858167 1.54414 1.805436
C  -0.152698 -2.667692 -1.23025
C  -0.856907 -2.420156 1.059814
C  -2.318821 1.962378 0.574501
C  -1.309231 -3.381805 -1.506321
C  -2.000549 -3.154521 0.785061
C  -2.232531 -3.628398 -0.499335
H  3.09525 -0.13415 1.779025
H  1.81035 1.796658 2.654093
H  3.340845 2.275571 1.946041
H  1.844458 2.56703 1.060409
H  0.142939 0.779719 -1.410918
H  -0.313629 0.486185 2.836474
H  -2.428937 1.765754 2.697644
H  0.569335 -2.48242 -2.015851
H  -0.680991 -2.057126 2.064338
H  -1.48674 -3.74992 -2.508485
H  -2.711734 -3.355486 1.575648
H  -3.130488 -4.193401 -0.71407
H  5.127327 0.881839 -0.759828
elementType: Cl F O N C H
totalener: -1458.15935705 hartree
nucrepener: 1958.32948428 hartree
electener: -3416.48884133 hartree
oneelecener: -5890.77573837 hartree
twoeener: 2474.28689704 hartree
cpcmener: -0.03601691 hartree
kineticenergy: 1453.43596547 hartree
xcener: -114.596441318554 hartree
chargesum: -0.0000000
charge: -0.066642 -0.201120 -0.488328 -0.294270 -0.429958 -0.032818 0.132471 0.003397 0.459119 -0.306419 0.007472 0.353264 -0.200593 -0.211951 0.067107 -0.122223 -0.206739 -0.180778 0.251821 -0.169246 -0.164975 -0.131457 0.107612 0.110260 0.118199 0.120123 0.129599 0.159941 0.152435 0.145734 0.156147 0.157198 0.156896 0.158998 0.259726
qa: -0.0666 -0.2011 -0.4883 -0.2943 -0.4300 -0.0328 0.1325 0.0034 0.4591 -0.3064 0.0075 0.3533 -0.2006 -0.2120 0.0671 -0.1222 -0.2067 -0.1808 0.2518 -0.1692 -0.1650 -0.1315 0.1076 0.1103 0.1182 0.1201 0.1296 0.1599 0.1524 0.1457 0.1561 0.1572 0.1569 0.1590 0.2597
va: 1.2368 1.0987 2.0257 2.2111 2.0524 2.9648 3.7430 3.6940 3.9758 3.9611 3.5519 4.2167 4.1006 3.9695 3.8467 3.8659 3.9971 3.9234 4.0480 3.9152 3.9252 3.8881 1.0303 1.0003 1.0128 0.9920 1.0497 1.0049 0.9968 1.0122 1.0006 0.9920 0.9928 0.9892 0.9930
dispcorr: -0.020123995 hartree
energy: -1458.179481046465
dipole: 11.44881 -11.66794 -0.21913 -10.91010 11.66110 0.75100 10.86708 -9.03810 1.82898
magnitude: 1.98927 au
magnitude: 5.05631 debye
