program: Orca
programVersion: 5.0.2
elementType: Cl F O O O N C C C C C C C C C C C C C C C C H H H H H H H H H H H H H
charge: 0
multiplicity: 1
keywords: wb97x-d3
keywords: def2-TZVPP
keywords: def2/J RIJCOSX
keywords: DEFGRID2
keywords: scfconv7
keywords: smallprint printgap noloewdin
keywords: NOSOSCF
formula: C16H13ClFNO3
InChI: InChI=1/C16H13ClFNO3/c1-10(16(21)22)19(12-7-8-14(18)13(17)9-12)15(20)11-5-3-2-4-6-11/h2-10,21H,1H3
35 atoms
Cl -1.963081 1.655714 -2.577882
F  -3.051235 2.934923 -0.212623
O  2.324156 -2.217808 0.494624
O  4.528471 1.142744 -0.232098
O  2.840386 0.271571 -1.396391
N  1.359755 -0.20469 0.864348
C  2.675935 0.402029 1.017978
C  0.230375 0.619021 0.593555
C  1.314394 -1.545803 0.610987
C  2.660495 1.692826 1.829004
C  -0.034975 -2.175805 0.512925
C  3.330314 0.59032 -0.344281
C  -0.235595 0.739434 -0.710508
C  -0.424648 1.284015 1.623123
C  -1.352407 1.512748 -0.974443
C  -1.528651 2.076458 1.355931
C  -0.97203 -2.049629 1.53467
C  -0.321546 -2.969137 -0.59352
C  -1.985002 2.18307 0.058557
C  -2.191205 -2.703315 1.44144
C  -1.551363 -3.602198 -0.694302
C  -2.487415 -3.47045 0.322516
H  3.297928 -0.313857 1.561426
H  2.136148 2.505945 1.329133
H  2.195078 1.518311 2.797569
H  3.681466 2.016989 2.020497
H  0.261187 0.222852 -1.519401
H  -0.087255 1.172389 2.644044
H  -2.042267 2.597795 2.153115
H  -0.748836 -1.457325 2.412676
H  0.408025 -3.078489 -1.386342
H  -2.911997 -2.610565 2.243462
H  -1.777241 -4.202629 -1.565913
H  -3.444571 -3.970141 0.246451
H  4.935276 1.241966 -1.107237
elementType: Cl F O N C H
totalener: -1458.15855756 hartree
nucrepener: 1961.49092064 hartree
electener: -3419.64947819 hartree
oneelecener: -5897.10764218 hartree
twoeener: 2477.45816399 hartree
cpcmener: -0.03584269 hartree
kineticenergy: 1453.42683532 hartree
xcener: -114.595414058325 hartree
chargesum: -0.0000000
charge: -0.067920 -0.202004 -0.486556 -0.301841 -0.425064 -0.053290 0.161598 0.082470 0.445750 -0.325789 -0.006300 0.368624 -0.212224 -0.249740 0.062268 -0.111698 -0.176881 -0.198237 0.239928 -0.166096 -0.170596 -0.128095 0.108557 0.115763 0.106254 0.115519 0.132481 0.159818 0.151710 0.156683 0.144358 0.156702 0.157142 0.159331 0.257372
qa: -0.0679 -0.2020 -0.4866 -0.3018 -0.4251 -0.0533 0.1616 0.0825 0.4457 -0.3258 -0.0063 0.3686 -0.2122 -0.2497 0.0623 -0.1117 -0.1769 -0.1982 0.2399 -0.1661 -0.1706 -0.1281 0.1086 0.1158 0.1063 0.1155 0.1325 0.1598 0.1517 0.1567 0.1444 0.1567 0.1571 0.1593 0.2574
va: 1.2357 1.0974 2.0197 2.2087 2.0511 2.9875 3.7168 3.6691 3.9932 3.9752 3.5489 4.1904 4.0932 3.9896 3.8420 3.8577 3.9256 3.9913 4.0647 3.9237 3.9248 3.8855 1.0323 0.9898 1.0023 1.0168 1.0464 1.0039 0.9966 1.0012 1.0142 0.9929 0.9922 0.9891 0.9962
dispcorr: -0.020004431 hartree
energy: -1458.178561985986
dipole: 10.59261 -10.65565 -0.06304 -9.20532 10.48363 1.27831 14.69530 -12.99954 1.69575
magnitude: 2.12453 au
magnitude: 5.40013 debye
