program: Orca
programVersion: 5.0.2
elementType: Cl F O O O N C C C C C C C C C C C C C C C C H H H H H H H H H H H H H
charge: 0
multiplicity: 1
keywords: wb97x-d3
keywords: def2-TZVPP
keywords: def2/J RIJCOSX
keywords: DEFGRID2
keywords: scfconv7
keywords: smallprint printgap noloewdin
keywords: NOSOSCF
formula: C16H13ClFNO3
InChI: InChI=1/C16H13ClFNO3/c1-10(16(21)22)19(12-7-8-14(18)13(17)9-12)15(20)11-5-3-2-4-6-11/h2-10,21H,1H3
35 atoms
Cl -2.700188 3.096254 -1.433526
F  -3.6767 2.13566 1.132634
O  2.520745 -1.840772 -0.253632
O  4.474217 0.704207 0.910439
O  2.667416 0.097821 2.067446
N  1.192647 -0.024219 -0.273091
C  2.383932 0.813155 -0.21637
C  -0.045718 0.545552 0.113872
C  1.399269 -1.382549 -0.297665
C  3.18169 0.819543 -1.515046
C  0.207183 -2.274485 -0.396331
C  3.172905 0.464569 1.0444
C  -0.676678 1.443585 -0.738024
C  -0.630454 0.222131 1.33163
C  -1.898466 1.993551 -0.388312
C  -1.86221 0.753291 1.67221
C  0.225555 -3.456007 0.338319
C  -0.868379 -2.010015 -1.238796
C  -2.490501 1.629891 0.811154
C  -0.837203 -4.341054 0.263063
C  -1.920187 -2.906667 -1.328886
C  -1.912851 -4.067329 -0.569126
H  2.024111 1.833284 -0.045707
H  2.515353 1.056136 -2.344143
H  3.955098 1.584655 -1.485617
H  3.654754 -0.137253 -1.715494
H  -0.228592 1.697408 -1.689989
H  -0.119707 -0.444728 2.011247
H  -2.3361 0.498928 2.610463
H  1.074795 -3.676576 0.971162
H  -0.88714 -1.111882 -1.840736
H  -0.822218 -5.24986 0.849731
H  -2.748091 -2.696182 -1.992534
H  -2.740842 -4.761046 -0.632116
H  4.908544 0.493637 1.748029
totalener: -1458.13213398 hartree
nucrepener: 1940.72313889 hartree
electener: -3398.85527286 hartree
oneelecener: -5854.96201292 hartree
twoeener: 2456.10674006 hartree
kineticenergy: 1453.48652099 hartree
xcener: -114.598179637896 hartree
chargesum: -0.0000000
charge: -0.048798 -0.182848 -0.388405 -0.259047 -0.356439 -0.040532 0.048392 0.035913 0.419904 -0.258303 -0.058830 0.339955 -0.249580 -0.163931 0.101776 -0.128410 -0.143868 -0.153709 0.236788 -0.145240 -0.142477 -0.092764 0.098470 0.081842 0.100431 0.119018 0.125484 0.127420 0.127716 0.129109 0.133793 0.127549 0.127060 0.128822 0.203741
qa: -0.0488 -0.1828 -0.3884 -0.2590 -0.3564 -0.0405 0.0484 0.0359 0.4199 -0.2583 -0.0588 0.3400 -0.2496 -0.1639 0.1018 -0.1284 -0.1439 -0.1537 0.2368 -0.1452 -0.1425 -0.0928 0.0985 0.0818 0.1004 0.1190 0.1255 0.1274 0.1277 0.1291 0.1338 0.1275 0.1271 0.1288 0.2037
va: 1.2549 1.1237 2.1140 2.2112 2.1316 2.9211 3.8527 3.7416 3.9989 3.9056 3.6349 4.2445 4.0895 4.0424 3.8288 3.8918 4.0240 3.9638 4.0679 3.9676 3.9847 3.9370 1.0047 1.0061 1.0125 1.0163 1.0339 1.0296 1.0064 1.0240 1.0023 1.0021 1.0026 0.9987 1.0447
dispcorr: -0.019532077 hartree
energy: -1458.151666053755
dipole: 15.44315 -15.46723 -0.02407 -15.80653 15.91529 0.10877 -2.22060 2.15190 -0.06870
magnitude: 0.13088 au
magnitude: 0.33267 debye
