program: Orca
programVersion: 5.0.2
elementType: Cl F O O O N C C C C C C C C C C C C C C C C H H H H H H H H H H H H H
charge: 0
multiplicity: 1
keywords: wb97x-d3
keywords: def2-TZVPP
keywords: def2/J RIJCOSX
keywords: DEFGRID2
keywords: scfconv7
keywords: smallprint printgap noloewdin
keywords: NOSOSCF
formula: C16H13ClFNO3
InChI: InChI=1/C16H13ClFNO3/c1-10(16(21)22)19(12-7-8-14(18)13(17)9-12)15(20)11-5-3-2-4-6-11/h2-10,21H,1H3
35 atoms
Cl -1.384082 3.341205 -1.747065
F  -3.47655 2.541124 0.112264
O  2.15047 -2.366578 1.166722
O  2.884049 0.103215 -1.266249
O  4.02754 1.631986 -0.113039
N  1.161918 -0.386578 0.685266
C  2.373021 0.3352 1.050087
C  -0.037576 0.341297 0.515815
C  1.204815 -1.764791 0.708474
C  2.133832 1.479413 2.025012
C  0.046994 -2.504301 0.12566
C  3.180314 0.785371 -0.157628
C  -0.122503 1.342037 -0.445501
C  -1.130567 0.098094 1.340484
C  -1.27904 2.09222 -0.57336
C  -2.298877 0.824801 1.192767
C  -0.524101 -2.149577 -1.092427
C  -0.392013 -3.649675 0.781872
C  -2.365779 1.823549 0.243041
C  -1.539595 -2.920522 -1.634044
C  -1.424041 -4.405116 0.250484
C  -1.999397 -4.041592 -0.958534
H  3.012448 -0.398229 1.551592
H  1.604839 1.112222 2.903491
H  3.087284 1.888128 2.350833
H  1.553562 2.293336 1.59317
H  0.701117 1.53684 -1.117372
H  -1.071708 -0.667261 2.102117
H  -3.15501 0.632481 1.825211
H  -0.164718 -1.283563 -1.63169
H  0.079089 -3.947073 1.70941
H  -1.972093 -2.645684 -2.586715
H  -1.770818 -5.286043 0.774036
H  -2.798957 -4.636975 -1.37899
H  3.48807 0.389072 -1.965091
totalener: -1458.13087848 hartree
nucrepener: 1948.98350649 hartree
electener: -3407.11438497 hartree
oneelecener: -5870.88544831 hartree
twoeener: 2463.77106334 hartree
kineticenergy: 1453.48732428 hartree
xcener: -114.600025528700 hartree
chargesum: 0.0000000
charge: -0.042363 -0.182285 -0.376899 -0.253326 -0.326392 -0.007299 0.011892 -0.052572 0.390135 -0.245286 -0.035750 0.321007 -0.228675 -0.133638 0.107120 -0.127794 -0.141349 -0.159166 0.232750 -0.134877 -0.137847 -0.099502 0.104172 0.098179 0.114626 0.099162 0.117852 0.121105 0.127275 0.130804 0.125933 0.128256 0.128647 0.130004 0.196101
qa: -0.0424 -0.1823 -0.3769 -0.2533 -0.3264 -0.0073 0.0119 -0.0526 0.3901 -0.2453 -0.0358 0.3210 -0.2287 -0.1336 0.1071 -0.1278 -0.1413 -0.1592 0.2328 -0.1349 -0.1378 -0.0995 0.1042 0.0982 0.1146 0.0992 0.1179 0.1211 0.1273 0.1308 0.1259 0.1283 0.1286 0.1300 0.1961
va: 1.2641 1.1247 2.1337 2.2000 2.1726 2.9111 3.7808 3.8260 4.0274 3.9549 3.6222 4.2847 3.9504 3.9846 3.8530 3.9092 3.9620 4.0211 4.0684 3.9759 3.9654 3.9460 1.0504 1.0047 1.0160 1.0014 1.0623 1.0179 1.0063 1.0092 1.0253 1.0018 1.0015 0.9985 1.0475
dispcorr: -0.019970549 hartree
energy: -1458.150849024515
dipole: 7.69502 -8.64923 -0.95421 -16.94102 16.51014 -0.43087 8.20733 -8.27363 -0.06630
magnitude: 1.04907 au
magnitude: 2.66654 debye
