program: Orca
programVersion: 5.0.2
elementType: Cl F O O O N C C C C C C C C C C C C C C C C H H H H H H H H H H H H H
charge: 0
multiplicity: 1
keywords: wb97x-d3
keywords: def2-TZVPP
keywords: def2/J RIJCOSX
keywords: DEFGRID2
keywords: scfconv7
keywords: smallprint printgap noloewdin
keywords: NOSOSCF
formula: C16H13ClFNO3
InChI: InChI=1/C16H13ClFNO3/c1-10(16(21)22)19(12-7-8-14(18)13(17)9-12)15(20)11-5-3-2-4-6-11/h2-10,21H,1H3
35 atoms
Cl -2.484473 2.714493 2.025579
F  -3.639609 2.529896 -0.63473
O  2.573606 -1.773951 -0.450897
O  4.409821 0.508592 1.30732
O  2.503585 -0.180455 2.238511
N  1.242491 0.019796 -0.216776
C  2.408305 0.844456 0.068979
C  -0.014143 0.653453 -0.336252
C  1.449918 -1.319978 -0.416956
C  3.296102 1.084051 -1.146248
C  0.257496 -2.201897 -0.58726
C  3.097226 0.300468 1.31511
C  -0.5632 1.290186 0.771413
C  -0.696399 0.6617 -1.545215
C  -1.784722 1.930801 0.667918
C  -1.928263 1.286941 -1.645319
C  -0.822522 -2.174522 0.289252
C  0.288262 -3.147871 -1.606672
C  -2.462427 1.920379 -0.542447
C  -1.870549 -3.066217 0.129141
C  -0.772071 -4.022683 -1.779126
C  -1.854032 -3.982368 -0.912091
H  2.017097 1.819704 0.37777
H  4.050965 1.837224 -0.926994
H  3.797339 0.178104 -1.473798
H  2.684257 1.462584 -1.965442
H  -0.046058 1.258495 1.722261
H  -0.270753 0.167778 -2.407924
H  -2.474174 1.293526 -2.578967
H  -0.841665 -1.474243 1.113099
H  1.146137 -3.197442 -2.264305
H  -2.701659 -3.045288 0.821212
H  -0.74785 -4.745482 -2.583782
H  -2.678447 -4.671189 -1.041127
H  4.774868 0.169869 2.135692
totalener: -1458.13166837 hartree
nucrepener: 1939.02757756 hartree
electener: -3397.15924593 hartree
oneelecener: -5851.46960114 hartree
twoeener: 2454.31035521 hartree
kineticenergy: 1453.49172771 hartree
xcener: -114.599532357039 hartree
chargesum: -0.0000000
charge: -0.043290 -0.182228 -0.389329 -0.257102 -0.352685 0.008102 0.046025 -0.017325 0.415679 -0.283752 -0.060811 0.364061 -0.260539 -0.163518 0.099202 -0.126674 -0.143659 -0.142598 0.233847 -0.142101 -0.155301 -0.090152 0.092382 0.100477 0.117017 0.087032 0.144725 0.121197 0.126460 0.143612 0.124222 0.127879 0.126710 0.128824 0.203608
qa: -0.0433 -0.1822 -0.3893 -0.2571 -0.3527 0.0081 0.0460 -0.0173 0.4157 -0.2838 -0.0608 0.3641 -0.2605 -0.1635 0.0992 -0.1267 -0.1437 -0.1426 0.2338 -0.1421 -0.1553 -0.0902 0.0924 0.1005 0.1170 0.0870 0.1447 0.1212 0.1265 0.1436 0.1242 0.1279 0.1267 0.1288 0.2036
va: 1.2612 1.1243 2.1180 2.2201 2.1341 2.9463 3.8232 3.7595 4.0172 3.9411 3.6336 4.2131 4.0219 4.0074 3.8270 3.9050 3.9515 4.0038 4.0725 3.9728 3.9744 3.9350 1.0045 1.0115 1.0192 1.0018 1.0414 1.0188 1.0069 0.9997 1.0232 1.0026 1.0024 0.9985 1.0446
dispcorr: -0.019522741 hartree
energy: -1458.151191111197
dipole: 15.11664 -15.17765 -0.06101 -14.18494 14.50517 0.32024 -10.89829 10.10793 -0.79036
magnitude: 0.85495 au
magnitude: 2.17311 debye
