program: Orca
programVersion: 5.0.2
elementType: Cl Cl O O O N C C C C C C C C C C C C C C C C H H H H H H H H H H H H H H H
charge: 0
multiplicity: 1
keywords: wb97x-d3
keywords: def2-TZVPP
keywords: def2/J RIJCOSX
keywords: DEFGRID2
keywords: scfconv7
keywords: smallprint printgap noloewdin
keywords: NOSOSCF
formula: C16H15Cl2NO3
InChI: InChI=1/C16H15Cl2NO3/c1-2-21-10-22-12-8-6-11(7-9-12)16(20)19-14-5-3-4-13(17)15(14)18/h3-9,19H,2,10H2,1H3
37 atoms
Cl -2.537585 -1.860179 0.43293
Cl -5.595264 -1.699348 0.900766
O  5.049535 0.118922 -1.230851
O  5.819241 -0.694523 0.741509
O  -0.668015 2.741563 -1.055856
N  -1.258932 0.663634 -0.337352
C  1.049433 1.138145 -0.829967
C  3.740362 0.402858 -1.038129
C  -2.627982 0.79576 -0.130647
C  1.917156 1.835266 -1.673274
C  1.562943 0.080872 -0.083214
C  -0.360077 1.600503 -0.74953
C  3.240904 1.469005 -1.786187
C  2.896403 -0.285897 -0.171314
C  -3.352329 -0.350095 0.237999
C  -3.326462 1.997175 -0.260676
C  5.620455 -0.996634 -0.606288
C  -4.722546 -0.283552 0.455216
C  -4.691683 2.042667 -0.037931
C  -5.405138 0.912389 0.31683
C  6.427572 -1.765971 1.445386
C  6.47815 -1.426705 2.914658
H  1.554132 2.666388 -2.262419
H  0.946706 -0.465172 0.620121
H  3.899012 2.005963 -2.457074
H  3.247445 -1.09686 0.450221
H  -0.893941 -0.268863 -0.215516
H  -2.811491 2.900377 -0.536879
H  4.989245 -1.888538 -0.730328
H  6.57111 -1.166728 -1.123431
H  -5.209606 2.985545 -0.146801
H  -6.471698 0.955263 0.485177
H  5.858786 -2.691771 1.293057
H  7.438562 -1.943942 1.058403
H  6.969268 -2.234407 3.456675
H  5.47814 -1.305195 3.331339
H  7.043335 -0.512485 3.097458
elementType: Cl O N C H
totalener: -1819.68077998 hartree
nucrepener: 1916.72015770 hartree
electener: -3736.40093768 hartree
oneelecener: -6304.51516889 hartree
twoeener: 2568.11423121 hartree
cpcmener: -0.03338619 hartree
kineticenergy: 1814.50935427 hartree
xcener: -128.534465760751 hartree
chargesum: 0.0000000
charge: -0.073713 -0.066555 -0.321165 -0.374014 -0.523986 -0.151806 -0.006172 0.314301 0.228765 -0.145892 -0.222137 0.480753 -0.237552 -0.178739 -0.077524 -0.226460 0.107471 0.098610 -0.139206 -0.178420 0.057052 -0.248385 0.143898 0.132197 0.144336 0.147245 0.169939 0.163336 0.125567 0.127332 0.162307 0.146304 0.080645 0.086186 0.085998 0.085062 0.084426
qa: -0.0737 -0.0666 -0.3212 -0.3740 -0.5240 -0.1518 -0.0062 0.3143 0.2288 -0.1459 -0.2221 0.4808 -0.2376 -0.1787 -0.0775 -0.2265 0.1075 0.0986 -0.1392 -0.1784 0.0571 -0.2484 0.1439 0.1322 0.1443 0.1472 0.1699 0.1633 0.1256 0.1273 0.1623 0.1463 0.0806 0.0862 0.0860 0.0851 0.0844
va: 1.2732 1.2522 2.0917 1.9001 1.9765 3.2735 3.5908 3.7945 3.7605 4.0231 4.0470 3.9887 4.0279 3.8807 3.9842 3.9492 3.9714 3.8840 3.9622 4.0000 3.8637 3.9490 1.0219 1.0236 1.0109 1.0094 1.0416 1.0339 0.9787 0.9915 0.9892 1.0044 0.9901 0.9922 1.0076 1.0036 1.0049
dispcorr: -0.015196889 hartree
energy: -1819.695976869238
dipole: 47.36228 -46.15661 1.20567 2.82163 -4.82936 -2.00773 4.10706 -3.67454 0.43252
magnitude: 2.38153 au
magnitude: 6.05338 debye
