program: Orca
programVersion: 5.0.2
elementType: Cl Cl O O O N C C C C C C C C C C C C C C C C H H H H H H H H H H H H H H H
charge: 0
multiplicity: 1
keywords: wb97x-d3
keywords: def2-TZVPP
keywords: def2/J RIJCOSX
keywords: DEFGRID2
keywords: scfconv7
keywords: smallprint printgap noloewdin
keywords: NOSOSCF
formula: C16H15Cl2NO3
InChI: InChI=1/C16H15Cl2NO3/c1-2-21-10-22-12-8-6-11(7-9-12)16(20)19-14-5-3-4-13(17)15(14)18/h3-9,19H,2,10H2,1H3
37 atoms
Cl -3.168171 -1.91458 -0.0598
Cl -6.178485 -1.191585 -0.049198
O  4.683051 -1.588062 -0.284251
O  6.38974 -0.099449 -0.201127
O  -0.24375 2.348877 0.361144
N  -1.335818 0.374861 0.029827
C  1.063139 0.407393 0.026318
C  3.539311 -0.874725 -0.151089
C  -2.673187 0.755605 0.040022
C  2.185414 0.927839 0.664426
C  1.206819 -0.759453 -0.726482
C  -0.219288 1.146939 0.148596
C  3.416649 0.300097 0.587522
C  2.429697 -1.392458 -0.817309
C  -3.647353 -0.255316 -0.002529
C  -3.107271 2.081396 0.077699
C  5.827909 -1.210976 0.427673
C  -4.999198 0.062144 -0.000773
C  -4.459174 2.377399 0.07777
C  -5.417389 1.381035 0.04057
C  7.562511 0.352847 0.45568
C  8.023345 1.639296 -0.184824
H  2.103609 1.838444 1.242765
H  0.373905 -1.183324 -1.273776
H  4.256849 0.743511 1.102791
H  2.532977 -2.293762 -1.407528
H  -1.173272 -0.619213 -0.027624
H  -2.393795 2.886281 0.106626
H  5.591836 -1.000368 1.480428
H  6.497136 -2.076714 0.387259
H  -4.770097 3.412542 0.10852
H  -6.471377 1.61998 0.042603
H  7.361634 0.514511 1.52199
H  8.348998 -0.409303 0.390292
H  7.277194 2.427428 -0.078751
H  8.2377 1.506167 -1.245791
H  8.938546 1.978492 0.299494
elementType: Cl O N C H
totalener: -1819.68091226 hartree
nucrepener: 1906.26354689 hartree
electener: -3725.94445914 hartree
oneelecener: -6283.73945510 hartree
twoeener: 2557.79499596 hartree
cpcmener: -0.03324861 hartree
kineticenergy: 1814.50646386 hartree
xcener: -128.533632150021 hartree
chargesum: 0.0000000
charge: -0.074073 -0.066821 -0.321990 -0.374389 -0.523336 -0.150358 -0.004683 0.308558 0.229606 -0.191687 -0.178645 0.477870 -0.191707 -0.215545 -0.077246 -0.226146 0.107857 0.099436 -0.139572 -0.177580 0.058044 -0.247600 0.143513 0.134040 0.146215 0.144877 0.168771 0.161154 0.124266 0.127538 0.163058 0.146072 0.079909 0.085602 0.084693 0.084239 0.086062
qa: -0.0741 -0.0668 -0.3220 -0.3744 -0.5233 -0.1504 -0.0047 0.3086 0.2296 -0.1917 -0.1786 0.4779 -0.1917 -0.2155 -0.0772 -0.2261 0.1079 0.0994 -0.1396 -0.1776 0.0580 -0.2476 0.1435 0.1340 0.1462 0.1449 0.1688 0.1612 0.1243 0.1275 0.1631 0.1461 0.0799 0.0856 0.0847 0.0842 0.0861
va: 1.2724 1.2519 2.0897 1.8989 1.9761 3.2660 3.5892 3.7957 3.7554 4.0399 4.0212 3.9955 3.9039 3.9997 3.9833 3.9498 3.9724 3.8823 3.9654 4.0018 3.8643 3.9480 1.0250 1.0199 1.0093 1.0100 1.0427 1.0338 0.9783 0.9919 0.9889 1.0044 0.9905 0.9922 1.0036 1.0049 1.0076
dispcorr: -0.015220226 hartree
energy: -1819.696132483830
dipole: 56.55004 -55.03135 1.51869 12.99924 -13.68485 -0.68561 2.45521 -1.68483 0.77037
magnitude: 1.83574 au
magnitude: 4.66609 debye
