program: Orca
programVersion: 5.0.2
elementType: Cl Cl O O O N C C C C C C C C C C C C C C C C H H H H H H H H H H H H H H H
charge: 0
multiplicity: 1
keywords: wb97x-d3
keywords: def2-TZVPP
keywords: def2/J RIJCOSX
keywords: DEFGRID2
keywords: scfconv7
keywords: smallprint printgap noloewdin
keywords: NOSOSCF
formula: C16H15Cl2NO3
InChI: InChI=1/C16H15Cl2NO3/c1-2-21-10-22-12-8-6-11(7-9-12)16(20)19-14-5-3-4-13(17)15(14)18/h3-9,19H,2,10H2,1H3
37 atoms
Cl -2.758553 -1.900481 0.211356
Cl -5.850839 -1.815631 0.140311
O  4.921734 0.238776 0.19386
O  6.717658 -1.052068 0.662613
O  -0.76845 2.855341 -0.428118
N  -1.430105 0.702337 -0.074743
C  0.912125 1.238045 -0.057298
C  3.607166 0.512494 0.149989
C  -2.817357 0.796939 -0.115868
C  1.296884 0.133288 0.69695
C  1.905931 1.988837 -0.691168
C  -0.496223 1.687866 -0.197389
C  2.629746 -0.231189 0.809064
C  3.232196 1.629147 -0.601495
C  -3.564588 -0.385952 0.010863
C  -3.514637 1.995905 -0.272954
C  5.357686 -0.955023 0.833008
C  -4.952623 -0.355315 -0.02228
C  -4.898196 2.005128 -0.30585
C  -5.63214 0.839582 -0.183591
C  7.13698 -1.462392 -0.637536
C  8.621045 -1.733683 -0.600342
H  0.572069 -0.455169 1.246058
H  1.637084 2.856612 -1.278706
H  2.882189 -1.085107 1.422318
H  3.990522 2.207779 -1.113328
H  -1.066084 -0.234492 0.01329
H  -2.98095 2.924739 -0.372755
H  5.162516 -0.897493 1.90718
H  4.824334 -1.815804 0.406379
H  -5.414028 2.94723 -0.431311
H  -6.712419 0.853804 -0.211818
H  6.589762 -2.364721 -0.93348
H  6.915235 -0.68793 -1.377741
H  8.865991 -2.534796 0.097689
H  9.184134 -0.843416 -0.317511
H  8.95933 -2.038511 -1.590271
elementType: Cl O N C H
totalener: -1819.68232557 hartree
nucrepener: 1895.40263004 hartree
electener: -3715.08495561 hartree
oneelecener: -6261.52370209 hartree
twoeener: 2546.43874647 hartree
cpcmener: -0.03307327 hartree
kineticenergy: 1814.51026721 hartree
xcener: -128.534208243083 hartree
chargesum: -0.0000000
charge: -0.073490 -0.066684 -0.318858 -0.370690 -0.524157 -0.152469 -0.013515 0.339491 0.228580 -0.213082 -0.148039 0.484306 -0.208940 -0.242432 -0.077263 -0.226429 0.102507 0.098062 -0.139512 -0.177671 0.062613 -0.245239 0.135031 0.143453 0.144959 0.144426 0.170776 0.162279 0.135026 0.120273 0.162563 0.146066 0.078199 0.085615 0.083765 0.085473 0.085006
qa: -0.0735 -0.0667 -0.3189 -0.3707 -0.5242 -0.1525 -0.0135 0.3395 0.2286 -0.2131 -0.1480 0.4843 -0.2089 -0.2424 -0.0773 -0.2264 0.1025 0.0981 -0.1395 -0.1777 0.0626 -0.2452 0.1350 0.1435 0.1450 0.1444 0.1708 0.1623 0.1350 0.1203 0.1626 0.1461 0.0782 0.0856 0.0838 0.0855 0.0850
va: 1.2733 1.2521 2.0427 1.9827 1.9758 3.2659 3.5925 3.7893 3.7594 4.0429 4.0183 3.9832 3.8999 4.0203 3.9831 3.9491 3.9829 3.8837 3.9643 4.0002 3.8379 3.9487 1.0225 1.0211 1.0099 1.0097 1.0409 1.0347 0.9804 0.9809 0.9890 1.0046 0.9921 0.9931 1.0050 1.0048 1.0075
dispcorr: -0.014904797 hartree
energy: -1819.697230370782
dipole: 52.48803 -51.84832 0.63970 3.85570 -5.45936 -1.60365 -2.89305 2.81047 -0.08259
magnitude: 1.72851 au
magnitude: 4.39352 debye
