program: Orca
programVersion: 5.0.2
elementType: Cl Cl O O O N C C C C C C C C C C C C C C C C H H H H H H H H H H H H H H H
charge: 0
multiplicity: 1
keywords: wb97x-d3
keywords: def2-TZVPP
keywords: def2/J RIJCOSX
keywords: DEFGRID2
keywords: scfconv7
keywords: smallprint printgap noloewdin
keywords: NOSOSCF
formula: C16H15Cl2NO3
InChI: InChI=1/C16H15Cl2NO3/c1-2-21-10-22-12-8-6-11(7-9-12)16(20)19-14-5-3-4-13(17)15(14)18/h3-9,19H,2,10H2,1H3
37 atoms
Cl -2.834675 -1.899647 0.243339
Cl -5.917333 -1.662631 0.289808
O  4.872498 -0.338329 -0.4126
O  7.127251 -0.274805 -0.179594
O  -0.627177 2.779538 -0.170095
N  -1.39018 0.63338 -0.087977
C  0.972897 1.040573 -0.217413
C  3.631093 0.163446 -0.316248
C  -2.771216 0.797996 -0.081238
C  1.290569 -0.22375 -0.721634
C  2.012026 1.854496 0.223757
C  -0.410472 1.577668 -0.163347
C  2.597999 -0.656833 -0.774757
C  3.32848 1.426667 0.192588
C  -3.57054 -0.346717 0.074819
C  -3.413355 2.028254 -0.22968
C  5.971847 0.420994 0.081535
C  -4.955768 -0.248266 0.09082
C  -4.795305 2.104844 -0.213742
C  -5.580717 0.978226 -0.051237
C  7.490186 -1.29124 0.752655
C  6.807762 -2.622962 0.517294
H  0.526405 -0.884635 -1.111497
H  1.800052 2.84006 0.616216
H  2.829952 -1.632715 -1.181154
H  4.097196 2.09121 0.562032
H  -1.071142 -0.317382 0.022746
H  -2.840588 2.930024 -0.357588
H  6.031211 1.373022 -0.454137
H  5.833348 0.610489 1.154939
H  -5.26871 3.06996 -0.330106
H  -6.659089 1.04646 -0.036486
H  8.568976 -1.408638 0.643265
H  7.304673 -0.941193 1.774219
H  6.917323 -2.947524 -0.518054
H  5.747521 -2.602376 0.764959
H  7.27658 -3.377534 1.150115
elementType: Cl O N C H
totalener: -1819.68006225 hartree
nucrepener: 1905.32018425 hartree
electener: -3725.00024649 hartree
oneelecener: -6281.52222968 hartree
twoeener: 2556.52198319 hartree
cpcmener: -0.03282369 hartree
kineticenergy: 1814.51362664 hartree
xcener: -128.535219765812 hartree
chargesum: -0.0000000
charge: -0.073661 -0.066652 -0.315384 -0.378556 -0.525195 -0.152140 -0.013627 0.334613 0.229443 -0.174968 -0.183343 0.478688 -0.227248 -0.218356 -0.076930 -0.226479 0.103898 0.098678 -0.138876 -0.178231 0.067103 -0.254625 0.133301 0.143414 0.145209 0.144960 0.170378 0.161512 0.133660 0.120958 0.162435 0.145870 0.099317 0.073153 0.083894 0.080297 0.093490
qa: -0.0737 -0.0667 -0.3154 -0.3786 -0.5252 -0.1521 -0.0136 0.3346 0.2294 -0.1750 -0.1833 0.4787 -0.2272 -0.2184 -0.0769 -0.2265 0.1039 0.0987 -0.1389 -0.1782 0.0671 -0.2546 0.1333 0.1434 0.1452 0.1450 0.1704 0.1615 0.1337 0.1210 0.1624 0.1459 0.0993 0.0732 0.0839 0.0803 0.0935
va: 1.2734 1.2523 2.0454 1.9770 1.9745 3.2669 3.5878 3.7950 3.7581 4.0122 4.0546 3.9968 3.9900 3.9308 3.9823 3.9514 3.9881 3.8841 3.9630 4.0006 3.8508 3.9122 1.0204 1.0242 1.0081 1.0093 1.0416 1.0342 0.9781 0.9807 0.9890 1.0046 0.9886 1.0021 1.0089 1.0079 1.0088
dispcorr: -0.015493641 hartree
energy: -1819.695555888901
dipole: 50.56238 -49.51890 1.04348 4.63490 -5.23011 -0.59521 1.86724 -1.02972 0.83752
magnitude: 1.46443 au
magnitude: 3.72230 debye
