program: Orca
programVersion: 5.0.2
elementType: Cl Cl O O O N C C C C C C C C C C C C C C C C H H H H H H H H H H H H H H H
charge: 0
multiplicity: 1
keywords: wb97x-d3
keywords: def2-TZVPP
keywords: def2/J RIJCOSX
keywords: DEFGRID2
keywords: scfconv7
keywords: smallprint printgap noloewdin
keywords: NOSOSCF
formula: C16H15Cl2NO3
InChI: InChI=1/C16H15Cl2NO3/c1-2-21-10-22-12-8-6-11(7-9-12)16(20)19-14-5-3-4-13(17)15(14)18/h3-9,19H,2,10H2,1H3
37 atoms
Cl -3.494309 0.515596 1.808549
Cl -3.958748 -2.421943 0.850173
O  4.48557 0.242315 -0.050352
O  4.100776 -2.053463 0.124422
O  -0.545256 4.028198 0.262149
N  -1.664473 2.089797 0.119626
C  0.775765 2.074486 0.129509
C  3.252105 0.786335 0.059553
C  -1.829105 0.763609 -0.298114
C  1.823584 2.597718 -0.625122
C  0.993675 0.916167 0.867225
C  -0.511311 2.808835 0.166867
C  3.042917 1.954059 -0.675161
C  2.220081 0.271628 0.842947
C  -2.689446 -0.07772 0.409433
C  -1.181238 0.271891 -1.426537
C  4.789153 -0.963017 0.624271
C  -2.884019 -1.389366 -0.011541
C  -1.355898 -1.043272 -1.816532
C  -2.209216 -1.880664 -1.116155
C  4.489959 -2.463607 -1.18265
C  3.81596 -3.777237 -1.494775
H  1.681261 3.503637 -1.199947
H  0.209376 0.502678 1.488509
H  3.845875 2.354716 -1.280627
H  2.340749 -0.622174 1.437516
H  -2.505921 2.617288 0.317888
H  -0.542727 0.926681 -2.003339
H  5.871205 -1.072739 0.504929
H  4.550198 -0.883895 1.687699
H  -0.839615 -1.416881 -2.689794
H  -2.358133 -2.904142 -1.430465
H  4.204555 -1.712256 -1.925543
H  5.580272 -2.570301 -1.229311
H  4.117484 -4.559817 -0.798023
H  4.092971 -4.09905 -2.498442
H  2.729642 -3.685791 -1.464693
elementType: Cl O N C H
totalener: -1819.67852754 hartree
nucrepener: 2022.92554423 hartree
electener: -3842.60407177 hartree
oneelecener: -6516.67933207 hartree
twoeener: 2674.07526030 hartree
cpcmener: -0.03648711 hartree
kineticenergy: 1814.52454551 hartree
xcener: -128.533655043619 hartree
chargesum: -0.0000000
charge: -0.057916 -0.066669 -0.338164 -0.381458 -0.515786 -0.162388 -0.042879 0.308872 0.167829 -0.165251 -0.179694 0.398190 -0.225728 -0.179462 -0.059216 -0.143242 0.161530 0.072271 -0.148353 -0.134920 0.051138 -0.249620 0.144901 0.154057 0.143760 0.141623 0.173306 0.153844 0.126294 0.125697 0.164317 0.146770 0.082734 0.080364 0.083313 0.084582 0.085353
qa: -0.0579 -0.0667 -0.3382 -0.3815 -0.5158 -0.1624 -0.0429 0.3089 0.1678 -0.1653 -0.1797 0.3982 -0.2257 -0.1795 -0.0592 -0.1432 0.1615 0.0723 -0.1484 -0.1349 0.0511 -0.2496 0.1449 0.1541 0.1438 0.1416 0.1733 0.1538 0.1263 0.1257 0.1643 0.1468 0.0827 0.0804 0.0833 0.0846 0.0854
va: 1.2850 1.2523 2.0590 1.9396 1.9872 3.1166 3.4976 3.7882 3.6117 4.0310 3.9784 4.1745 4.0080 3.8794 4.0423 3.9436 3.9300 3.8975 3.9482 3.9699 3.8813 3.9502 1.0127 0.9971 1.0094 1.0155 1.0228 0.9978 0.9905 0.9858 0.9875 1.0033 0.9886 0.9931 1.0050 1.0081 1.0040
dispcorr: -0.018123873 hartree
energy: -1819.696651416363
dipole: 40.21132 -38.91837 1.29295 -9.96281 7.65985 -2.30296 -14.75209 13.39047 -1.36163
magnitude: 2.97142 au
magnitude: 7.55275 debye
