program: Orca
programVersion: 5.0.2
elementType: Cl Cl O O O N C C C C C C C C C C C C C C C C H H H H H H H H H H H H H H H
charge: 0
multiplicity: 1
keywords: wb97x-d3
keywords: def2-TZVPP
keywords: def2/J RIJCOSX
keywords: DEFGRID2
keywords: scfconv7
keywords: smallprint printgap noloewdin
keywords: NOSOSCF
formula: C16H15Cl2NO3
InChI: InChI=1/C16H15Cl2NO3/c1-2-21-10-22-12-8-6-11(7-9-12)16(20)19-14-5-3-4-13(17)15(14)18/h3-9,19H,2,10H2,1H3
37 atoms
Cl -3.655213 -0.951964 -1.317856
Cl -3.978461 -2.041165 1.591651
O  4.487304 0.12971 -0.348945
O  4.074974 -1.478409 1.292994
O  -0.662655 2.364427 -3.248833
N  -1.698934 1.23717 -1.607845
C  0.737718 1.20271 -1.742072
C  3.243997 0.405256 -0.806672
C  -1.798073 0.726273 -0.308849
C  0.969392 -0.11728 -1.373444
C  1.787633 2.115545 -1.671593
C  -0.576743 1.656205 -2.255781
C  2.211319 -0.525279 -0.915253
C  3.022868 1.727789 -1.192984
C  -2.70645 -0.299953 -0.039436
C  -1.041953 1.245575 0.738067
C  4.780676 -1.162889 0.146164
C  -2.840022 -0.79333 1.254895
C  -1.155706 0.721713 2.012419
C  -2.056257 -0.296263 2.281832
C  4.444776 -0.73767 2.451432
C  3.685581 -1.287509 3.634434
H  0.180402 -0.855052 -1.447552
H  1.634016 3.14689 -1.961968
H  2.34195 -1.563242 -0.646767
H  3.82675 2.44876 -1.114016
H  -2.565675 1.428962 -2.092845
H  -0.366452 2.069144 0.553603
H  4.547852 -1.925488 -0.600901
H  5.860686 -1.145652 0.320257
H  -0.552071 1.125614 2.813261
H  -2.158449 -0.693469 3.281937
H  5.525736 -0.820372 2.614521
H  4.214574 0.324438 2.323408
H  3.963185 -0.736521 4.532717
H  3.912533 -2.340327 3.804612
H  2.608161 -1.182477 3.500703
elementType: Cl O N C H
totalener: -1819.67831135 hartree
nucrepener: 2027.21137142 hartree
electener: -3846.88968277 hartree
oneelecener: -6525.20266899 hartree
twoeener: 2678.31298621 hartree
cpcmener: -0.03620992 hartree
kineticenergy: 1814.51954157 hartree
xcener: -128.532843801696 hartree
chargesum: 0.0000000
charge: -0.059343 -0.067080 -0.339445 -0.380924 -0.511517 -0.161472 -0.042445 0.306211 0.177298 -0.174016 -0.168690 0.398099 -0.183874 -0.220432 -0.062811 -0.149344 0.162957 0.073756 -0.149504 -0.136677 0.046876 -0.248618 0.152746 0.144785 0.141148 0.143640 0.172077 0.155814 0.124716 0.125817 0.163819 0.146505 0.082650 0.084504 0.085007 0.083663 0.084103
qa: -0.0593 -0.0671 -0.3394 -0.3809 -0.5115 -0.1615 -0.0424 0.3062 0.1773 -0.1740 -0.1687 0.3981 -0.1839 -0.2204 -0.0628 -0.1493 0.1630 0.0738 -0.1495 -0.1367 0.0469 -0.2486 0.1527 0.1448 0.1411 0.1436 0.1721 0.1558 0.1247 0.1258 0.1638 0.1465 0.0826 0.0845 0.0850 0.0837 0.0841
va: 1.2839 1.2516 2.0595 1.9397 1.9907 3.1147 3.5046 3.7863 3.6086 3.9751 4.0287 4.1718 3.8838 4.0031 4.0428 3.9419 3.9306 3.8946 3.9467 3.9703 3.8808 3.9503 0.9995 1.0119 1.0155 1.0091 1.0247 0.9963 0.9855 0.9900 0.9880 1.0033 0.9933 0.9881 1.0081 1.0050 1.0039
dispcorr: -0.018255301 hartree
energy: -1819.696566654311
dipole: 40.68852 -39.22625 1.46227 3.97810 -4.42961 -0.45151 14.72737 -12.16391 2.56346
magnitude: 2.98554 au
magnitude: 7.58863 debye
