program: Orca
programVersion: 5.0.2
elementType: Cl Cl O O O N C C C C C C C C C C C C C C C C H H H H H H H H H H H H H H H
charge: 0
multiplicity: 1
keywords: wb97x-d3
keywords: def2-TZVPP
keywords: def2/J RIJCOSX
keywords: DEFGRID2
keywords: scfconv7
keywords: smallprint printgap noloewdin
keywords: NOSOSCF
formula: C16H15Cl2NO3
InChI: InChI=1/C16H15Cl2NO3/c1-2-21-10-22-12-8-6-11(7-9-12)16(20)19-14-5-3-4-13(17)15(14)18/h3-9,19H,2,10H2,1H3
37 atoms
Cl -2.244124 -1.611846 1.040573
Cl -5.333477 -1.801091 1.08853
O  5.211265 0.828079 -0.140297
O  6.037352 -1.330208 0.113521
O  -0.680941 2.653607 -1.469769
N  -1.160981 0.775223 -0.267466
C  1.127359 1.423688 -0.572255
C  3.868629 0.976246 -0.214398
C  -2.55097 0.750995 -0.264576
C  1.60055 0.719981 0.532303
C  2.056624 1.926973 -1.483494
C  -0.312765 1.692683 -0.812886
C  2.954041 0.497375 0.720365
C  3.405919 1.699356 -1.315422
C  -3.187459 -0.349876 0.331847
C  -3.353327 1.753645 -0.810774
C  5.826678 -0.10812 0.728443
C  -4.572717 -0.437838 0.361867
C  -4.73282 1.650263 -0.766303
C  -5.35797 0.561214 -0.187311
C  4.924043 -2.218591 0.082997
C  5.40905 -3.590521 -0.320802
H  0.925621 0.349674 1.293988
H  1.721711 2.486145 -2.347225
H  3.264544 -0.044517 1.60211
H  4.115494 2.078191 -2.040076
H  -0.721524 -0.028361 0.155707
H  -2.904998 2.616119 -1.272432
H  6.806062 0.314245 0.943866
H  5.272491 -0.211611 1.66609
H  -5.332713 2.44046 -1.19652
H  -6.435767 0.485274 -0.159483
H  4.452528 -2.258495 1.071384
H  4.167639 -1.869341 -0.627485
H  6.128343 -3.989397 0.395759
H  5.87273 -3.578118 -1.307914
H  4.563296 -4.276787 -0.36133
elementType: Cl O N C H
totalener: -1819.67984446 hartree
nucrepener: 1936.96659069 hartree
electener: -3756.64643516 hartree
oneelecener: -6344.42905425 hartree
twoeener: 2587.78261909 hartree
cpcmener: -0.03417641 hartree
kineticenergy: 1814.50964266 hartree
xcener: -128.535259599990 hartree
chargesum: 0.0000000
charge: -0.073958 -0.066397 -0.328296 -0.366431 -0.524393 -0.152410 0.003332 0.293247 0.227841 -0.210043 -0.157404 0.477820 -0.176224 -0.228861 -0.074722 -0.224626 0.106181 0.096800 -0.140178 -0.177991 0.065601 -0.257146 0.133756 0.143956 0.150202 0.142990 0.172451 0.160168 0.124676 0.123181 0.163584 0.146185 0.085400 0.084382 0.084884 0.085902 0.086536
qa: -0.0740 -0.0664 -0.3283 -0.3664 -0.5244 -0.1524 0.0033 0.2932 0.2278 -0.2100 -0.1574 0.4778 -0.1762 -0.2289 -0.0747 -0.2246 0.1062 0.0968 -0.1402 -0.1780 0.0656 -0.2571 0.1338 0.1440 0.1502 0.1430 0.1725 0.1602 0.1247 0.1232 0.1636 0.1462 0.0854 0.0844 0.0849 0.0859 0.0865
va: 1.2731 1.2525 2.0645 1.9498 1.9761 3.2657 3.5809 3.7579 3.7579 4.0247 4.0288 3.9884 3.8613 4.0210 3.9830 3.9511 4.0187 3.8851 3.9643 4.0002 3.8429 3.9681 1.0232 1.0204 1.0026 1.0109 1.0402 1.0350 0.9913 0.9823 0.9887 1.0044 0.9875 0.9803 1.0054 1.0044 1.0063
dispcorr: -0.016101978 hartree
energy: -1819.695946442467
dipole: 40.18874 -39.89702 0.29172 -0.60423 -0.48556 -1.08979 -4.85132 6.12065 1.26933
magnitude: 1.69821 au
magnitude: 4.31652 debye
