program: Orca
programVersion: 5.0.2
elementType: Cl Cl O O O N C C C C C C C C C C C C C C C C H H H H H H H H H H H H H H H
charge: 0
multiplicity: 1
keywords: wb97x-d3
keywords: def2-TZVPP
keywords: def2/J RIJCOSX
keywords: DEFGRID2
keywords: scfconv7
keywords: smallprint printgap noloewdin
keywords: NOSOSCF
formula: C16H15Cl2NO3
InChI: InChI=1/C16H15Cl2NO3/c1-2-21-10-22-12-8-6-11(7-9-12)16(20)19-14-5-3-4-13(17)15(14)18/h3-9,19H,2,10H2,1H3
37 atoms
Cl -2.809416 -1.823561 0.600101
Cl -5.845435 -1.344591 0.96521
O  4.829713 -1.057571 -1.023511
O  6.179944 0.14032 0.459784
O  -0.414006 2.516612 -0.932662
N  -1.277278 0.50216 -0.30872
C  1.064711 0.675558 -0.81347
C  3.638772 -0.423203 -0.952703
C  -2.631563 0.779592 -0.156014
C  2.196022 1.476666 -0.684292
C  1.246155 -0.688945 -1.050706
C  -0.266641 1.32599 -0.705078
C  3.472736 0.944381 -0.738188
C  2.513285 -1.23072 -1.122069
C  -3.471107 -0.261409 0.274195
C  -3.21091 2.024507 -0.405908
C  6.030767 -0.332864 -0.831048
C  -4.833743 -0.052833 0.441162
C  -4.571203 2.212777 -0.233158
C  -5.396528 1.186728 0.189475
C  6.42923 -0.85949 1.444547
C  6.734758 -0.17533 2.754719
H  2.088133 2.539476 -0.513696
H  0.407219 -1.354118 -1.212933
H  4.312163 1.611471 -0.606987
H  2.638896 -2.288378 -1.314982
H  -1.004859 -0.435931 -0.056761
H  -2.604955 2.85105 -0.733065
H  6.817879 -1.042904 -1.100996
H  6.074939 0.527283 -1.5037
H  -4.994942 3.187339 -0.433108
H  -6.457699 1.342492 0.322619
H  5.560802 -1.515554 1.559197
H  7.27326 -1.484843 1.130888
H  6.920385 -0.925305 3.52315
H  5.897521 0.439343 3.087694
H  7.620778 0.455822 2.682122
elementType: Cl O N C H
totalener: -1819.68348317 hartree
nucrepener: 1920.73602521 hartree
electener: -3740.41950838 hartree
oneelecener: -6312.65467127 hartree
twoeener: 2572.23516289 hartree
cpcmener: -0.03002484 hartree
kineticenergy: 1814.49935752 hartree
xcener: -128.532682703149 hartree
chargesum: -0.0000000
charge: -0.074172 -0.066740 -0.336329 -0.380696 -0.525186 -0.152939 -0.009686 0.303490 0.228341 -0.188381 -0.180878 0.479550 -0.195518 -0.215958 -0.074003 -0.225402 0.159608 0.096967 -0.141186 -0.177274 0.048606 -0.250022 0.143085 0.134137 0.143292 0.142668 0.169435 0.162500 0.127178 0.126244 0.163267 0.145819 0.084016 0.081818 0.084908 0.085711 0.083732
qa: -0.0742 -0.0667 -0.3363 -0.3807 -0.5252 -0.1529 -0.0097 0.3035 0.2283 -0.1884 -0.1809 0.4795 -0.1955 -0.2160 -0.0740 -0.2254 0.1596 0.0970 -0.1412 -0.1773 0.0486 -0.2500 0.1431 0.1341 0.1433 0.1427 0.1694 0.1625 0.1272 0.1262 0.1633 0.1458 0.0840 0.0818 0.0849 0.0857 0.0837
va: 1.2732 1.2519 2.0629 1.9397 1.9752 3.2690 3.5955 3.8086 3.7595 4.0365 4.0207 3.9906 3.9222 4.0036 3.9809 3.9493 3.9307 3.8841 3.9637 3.9994 3.8804 3.9491 1.0250 1.0192 1.0159 1.0105 1.0432 1.0345 0.9900 0.9855 0.9888 1.0045 0.9884 0.9928 1.0080 1.0038 1.0047
dispcorr: -0.015570199 hartree
energy: -1819.699053372146
dipole: 50.04094 -48.66784 1.37310 7.82576 -8.87479 -1.04904 2.37220 -2.16227 0.20993
magnitude: 1.74068 au
magnitude: 4.42445 debye
