program: Gaussian 09
title: 000059102
version: EM64L-G09RevD.01
frameworkgroup: C1[X(C15H12F12N2O2)]
method: RPBEPBE
basis: SDD
operation: Freq
keyword: #p
keyword: freq=noraman
keyword: PBEPBE/SDD
title: #p freq=noraman PBEPBE/SDD
converged: YES YES NO NO
title: Mulliken charges:
elementType: F F F F F F F F F F F F O O N N C C C C C C C C C C C C C C C H H H H H H H H H H H H
charge: -0.131370 -0.147856 -0.126080 -0.140333 -0.129058 -0.137260 -0.124230 -0.157965 -0.163211 -0.121664 -0.156670 -0.148119 -0.473521 -0.412410 -0.105875 -0.451684 0.069959 0.022499 -0.622867 -0.631033 0.254911 0.361875 0.385592 0.391429 0.363951 0.476177 -0.424311 -0.339113 -0.190223 -0.200954 -0.258684 0.294766 0.294176 0.294313 0.268880 0.401235 0.387064 0.363529 0.222883 0.247296 0.228019 0.232356 0.233579
chargesum: 0.00000
title: Mulliken charges with hydrogens summed into heavy atoms:
elementType: F F F F F F F F F F F F O O N N C C C C C C C C C C C C C C C
charge: -0.131370 -0.147856 -0.126080 -0.140333 -0.129058 -0.137260 -0.124230 -0.157965 -0.163211 -0.121664 -0.156670 -0.148119 -0.072286 -0.025346 -0.105875 -0.088155 0.069959 0.022499 -0.033925 -0.067840 0.254911 0.361875 0.385592 0.391429 0.363951 0.476177 -0.201428 -0.091817 0.037796 0.031402 -0.025105
polarizability: 2.02342454e+02 1.85928647e-01 2.90296244e+02 -1.33229419e+01 -5.20356197e-01 1.26119110e+02
1716.lowfreq: -5.0585 -0.0001 0.0010 0.0011 2.1267 5.2301 12.9178 15.2720 24.8002
frequency: 12.8294 15.1176 24.6448 30.5943 33.9047 39.1003 42.5177 46.1203 56.8195 69.0000 82.1276 96.4215 126.9852 146.9874 150.8692 173.4346 180.8311 189.1667 210.8721 226.2951 240.8975 252.7793 258.7420 270.6544 279.3581 292.7736 297.3673 300.5041 310.5880 314.3035 333.9669 358.9383 378.8593 389.2190 402.9575 404.0661 405.1424 440.8848 453.6594 456.8227 458.7309 466.2475 487.8458 489.9583 498.4853 508.3819 545.4258 553.1512 570.0189 593.9655 605.6353 613.6840 622.8224 638.6516 658.6952 662.5145 679.6641 691.7752 719.0606 760.8309 795.3082 815.1475 828.5754 851.5209 860.6786 889.1437 897.0769 909.8645 928.0010 965.1721 980.9110 982.8903 988.8048 997.2210 1001.7255 1009.5116 1023.2673 1025.7632 1030.6683 1041.1813 1054.2942 1073.7279 1083.3305 1088.2909 1096.9649 1100.9146 1134.3181 1151.1197 1167.6745 1173.8866 1178.9592 1185.6279 1190.8458 1211.9458 1275.6705 1293.0146 1301.9638 1318.1439 1326.9500 1337.3299 1356.5073 1387.2849 1437.5207 1444.3542 1460.8111 1488.1394 1504.1117 1544.0825 1579.5983 1610.7955 1615.3260 2872.0809 2991.5840 3030.3001 3077.9144 3103.4668 3118.3723 3137.9481 3148.4441 3167.9808 3182.8816 3370.7847 3536.8737
redmass: 11.8799 12.6112 8.5604 4.8307 10.0044 14.0542 12.8897 10.3409 13.5926 14.3524 6.7763 10.9401 12.9084 8.5024 8.0048 11.9329 8.9811 8.9481 6.9535 4.9579 8.7159 8.4036 10.2357 9.8668 9.4608 7.4647 16.3056 12.6891 4.9860 12.3553 3.2494 2.9741 3.0123 2.0281 3.3878 6.5972 7.0607 5.0330 5.3346 13.5122 16.1392 11.3410 14.2994 13.5988 4.2003 3.2509 8.1954 8.8038 7.9481 5.9913 7.7872 6.5269 5.9648 8.1553 1.6742 11.9568 6.3774 1.8892 6.4390 1.7536 1.1355 5.4244 1.2634 3.4381 4.5654 3.5991 1.5125 5.6597 4.0182 1.3776 7.5582 5.8418 1.3592 3.7504 8.5228 3.5337 2.2588 11.5299 4.6863 7.3598 9.4817 6.8265 7.8346 2.2604 3.7075 6.9417 4.1414 4.9958 8.2661 1.0656 6.0217 1.4694 2.2145 2.7853 1.5789 1.8016 1.7650 1.4231 1.3943 1.5006 1.6722 6.8115 1.2993 1.7491 1.1116 2.4238 1.2865 2.0385 3.5946 3.0984 6.1218 1.0705 1.0635 1.0631 1.0979 1.0993 1.0881 1.0870 1.0932 1.0975 1.0968 1.0779 1.0660
irintensity: 0.0387 0.0257 0.7352 0.0956 0.0396 0.5296 0.2436 0.0405 0.2765 0.2267 0.0818 1.5055 2.1282 1.7062 5.2532 0.1096 2.2004 1.3502 0.9111 4.2615 2.0036 1.5177 0.9869 6.0754 5.7762 1.3857 1.4535 1.6820 10.8004 0.9972 13.2447 5.4575 43.4150 99.3578 2.0985 5.0409 6.2317 3.1019 13.8398 7.5785 6.0953 1.6738 1.0933 1.0565 8.3545 8.3833 1.3513 4.6317 31.1350 2.1330 42.3887 8.8767 22.5820 47.3007 48.8783 2.2642 3.8020 57.9956 23.7340 65.7735 57.8054 18.0677 4.2223 26.6692 21.7787 80.1123 14.7101 90.1064 109.2253 0.1262 37.0256 11.0696 4.1361 140.3328 12.5291 99.5214 4.7624 9.4546 65.0015 73.5548 327.4196 32.0907 202.3220 111.2361 86.0421 145.5407 289.1996 195.4656 181.7284 3.0329 293.9643 5.5171 11.5769 48.7803 7.1178 114.7218 19.9344 7.5684 16.4349 0.9391 14.4967 4.7883 19.6344 20.2538 6.1626 118.0981 87.1009 11.7690 225.6484 15.9737 115.4227 798.5564 6.7079 2.7652 0.0525 1.4097 12.4732 0.1368 23.4109 31.2041 3.6821 110.1713 47.0387
temp: 298.150 k
press: 1.00000 atm
elementType: 9 9 9 9 9 9 9 9 9 9 9 9 8 8 7 7 6 6 6 6 6 6 6 6 6 6 6 6 6 6 6 1 1 1 1 1 1 1 1 1 1 1 1
symmnumber: 1
zpe: 701952.2 jmol-1
zpe.correction: 0.267359 hartree
zpe.thermalcorrener: 0.297495 hartree
zpe.thermalcorrenthalpy: 0.298439 hartree
zpe.thermalcorrgfe: 0.202161 hartree
zpe.sumelectzpe: -2034.479908 hartree
zpe.sumelectthermal: -2034.449773 hartree
zpe.sumelectthermalent: -2034.448828 hartree
zpe.sumelectthermalfe: -2034.545107 hartree
dipole: -6.4638 3.2339 -0.3905
dipole: 7.2382
quadrupole: -188.0169 -168.4216 -184.6800
quadrupole: -2.8096 -2.0414 -0.2936
quadrupole: -7.6441 11.9512 -4.3071 -2.8096 -2.0414 -0.2936
hfenergy: -2034.7472678 hartree
pointgroup: C01 [X(C15H12F12N2O2)]
dipole: -2.6531106 -0.9687257 -0.3633812 debye
polarizability: 248.0500581|-42.3287666|242.5198126|6.7608785|-22.6308865|128.187937 unknown
InChI: InChI=1S/C15H12F12N2O2/c16-12(17,18)10(30,13(19,20)21)6-9(29-28-8-4-2-1-3-5-8)7-11(31,14(22,23)24)15(25,26)27/h1-5,28,30-31H,6-7H2
charge 0 multiplicity 1
43 atoms
F  -1.809484 -3.132923 2.333109
F  -2.522771 -4.414551 0.61459
F  -0.343038 -4.49096 1.269039
F  -1.091953 -4.129046 -1.734831
F  -0.401942 -2.034221 -2.219041
F  0.914474 -3.38154 -0.963756
F  3.349246 2.009738 2.289812
F  1.261286 1.143794 2.299776
F  3.049639 -0.231758 2.138181
F  4.509936 2.439286 -0.163332
F  4.684143 0.177205 -0.129543
F  3.744189 1.227734 -1.905899
O  -2.389805 -1.841699 -0.284001
O  1.722595 2.335158 -0.183089
N  -0.455296 0.859077 -0.364066
N  -1.79147 0.945028 -0.121445
C  -1.127896 -2.461856 0.079358
C  2.429689 1.131875 0.147213
C  -0.272075 -1.377513 0.792526
C  1.724784 -0.151058 -0.420158
C  0.249951 -0.219276 -0.045272
C  -1.435209 -3.634341 1.074625
C  -0.417716 -3.005083 -1.20607
C  2.543872 1.026927 1.711614
C  3.844311 1.260385 -0.498764
C  -2.519832 2.13159 -0.387543
C  -3.919696 2.105833 -0.147779
C  -1.906241 3.317748 -0.865884
C  -4.697082 3.256868 -0.387759
C  -2.697899 4.46116 -1.100793
C  -4.092612 4.443179 -0.865223
H  -0.911049 -0.978066 1.605401
H  0.58637 -1.878406 1.271309
H  1.823933 -0.096986 -1.519061
H  2.259088 -1.054148 -0.086175
H  -3.013353 -2.488362 -0.708067
H  0.749383 2.053461 -0.361582
H  -2.316221 0.074633 0.056507
H  -4.393332 1.192247 0.233194
H  -0.83209 3.350563 -1.062833
H  -5.775468 3.226928 -0.197433
H  -2.217387 5.373524 -1.470494
H  -4.696571 5.337652 -1.047963
