program: Orca
programVersion: 5.0.2
elementType: Cl Cl O O O N C C C C C C C C C C C C C C C C H H H H H H H H H H H H H H H
charge: 0
multiplicity: 1
keywords: wb97x-d3
keywords: def2-TZVPP
keywords: def2/J RIJCOSX
keywords: DEFGRID2
keywords: scfconv7
keywords: smallprint printgap noloewdin
keywords: NOSOSCF
formula: C16H15Cl2NO3
InChI: InChI=1/C16H15Cl2NO3/c1-2-21-10-22-12-8-6-11(7-9-12)16(20)19-14-5-3-4-13(17)15(14)18/h3-9,19H,2,10H2,1H3
37 atoms
Cl -2.39654 -1.762103 0.727486
Cl -5.48559 -1.713063 0.969468
O  5.158057 0.285549 -0.698595
O  5.341435 -1.950035 -0.025656
O  -0.603903 2.826871 -0.908088
N  -1.18419 0.718108 -0.265604
C  1.12626 1.237049 -0.662353
C  3.83153 0.520199 -0.707674
C  -2.569485 0.791231 -0.184396
C  2.120607 2.193546 -0.448594
C  1.514215 -0.074137 -0.921282
C  -0.291384 1.681548 -0.636999
C  3.452727 1.841337 -0.458023
C  2.850494 -0.440734 -0.944654
C  -3.265796 -0.336912 0.281083
C  -3.314448 1.916784 -0.542316
C  5.657027 -1.008708 -0.980499
C  -4.650521 -0.323935 0.385768
C  -4.694148 1.907924 -0.436124
C  -5.377223 0.798133 0.026745
C  6.090387 -1.918081 1.183925
C  5.593089 -0.905069 2.196054
H  1.848167 3.223393 -0.256356
H  0.780742 -0.842351 -1.135998
H  4.215785 2.587906 -0.275147
H  3.096139 -1.472687 -1.149349
H  -0.780388 -0.150193 0.051294
H  -2.818194 2.801247 -0.903057
H  5.260811 -1.365119 -1.935818
H  6.738034 -0.864215 -1.072967
H  -5.248585 2.792012 -0.721166
H  -6.455162 0.799182 0.108734
H  6.006189 -2.92344 1.60067
H  7.151427 -1.750102 0.963035
H  5.820469 0.122058 1.91095
H  6.074765 -1.092024 3.157219
H  4.515602 -0.992463 2.346875
elementType: Cl O N C H
totalener: -1819.69124943 hartree
nucrepener: 1941.69121803 hartree
electener: -3761.38246745 hartree
oneelecener: -6354.48802885 hartree
twoeener: 2593.10556140 hartree
cpcmener: -0.02444803 hartree
kineticenergy: 1814.51522721 hartree
xcener: -128.534270777841 hartree
chargesum: 0.0000000
charge: -0.074840 -0.065755 -0.324509 -0.369095 -0.492350 -0.154461 -0.007739 0.295005 0.227437 -0.144045 -0.218547 0.461301 -0.228927 -0.179592 -0.076416 -0.224296 0.147355 0.097220 -0.136681 -0.178274 0.045355 -0.264431 0.141810 0.132593 0.138735 0.138180 0.166199 0.161173 0.122654 0.123833 0.159559 0.143990 0.095765 0.072495 0.085737 0.100131 0.083430
qa: -0.0748 -0.0658 -0.3245 -0.3691 -0.4923 -0.1545 -0.0077 0.2950 0.2274 -0.1440 -0.2185 0.4613 -0.2289 -0.1796 -0.0764 -0.2243 0.1474 0.0972 -0.1367 -0.1783 0.0454 -0.2644 0.1418 0.1326 0.1387 0.1382 0.1662 0.1612 0.1227 0.1238 0.1596 0.1440 0.0958 0.0725 0.0857 0.1001 0.0834
va: 1.2718 1.2528 2.0689 1.9499 2.0140 3.2573 3.5886 3.8051 3.7626 4.0194 4.0403 4.0115 4.0250 3.9142 3.9776 3.9540 3.9490 3.8905 3.9635 4.0019 3.9002 3.9000 1.0209 1.0242 1.0127 1.0208 1.0444 1.0358 0.9867 0.9900 0.9900 1.0052 0.9897 1.0006 1.0070 1.0107 1.0075
dispcorr: -0.016440552 hartree
energy: -1819.707689979320
dipole: 44.82954 -43.31243 1.51712 5.47183 -6.43128 -0.95945 0.25932 -0.08617 0.17315
magnitude: 1.80338 au
magnitude: 4.58383 debye
