program: Orca
programVersion: 5.0.2
elementType: Cl Cl O O O N C C C C C C C C C C C C C C C C H H H H H H H H H H H H H H H
charge: 0
multiplicity: 1
keywords: wb97x-d3
keywords: def2-TZVPP
keywords: def2/J RIJCOSX
keywords: DEFGRID2
keywords: scfconv7
keywords: smallprint printgap noloewdin
keywords: NOSOSCF
formula: C16H15Cl2NO3
InChI: InChI=1/C16H15Cl2NO3/c1-2-21-10-22-12-8-6-11(7-9-12)16(20)19-14-5-3-4-13(17)15(14)18/h3-9,19H,2,10H2,1H3
37 atoms
Cl -2.645668 -1.885517 0.261553
Cl -5.734778 -1.80188 0.070467
O  5.086395 0.476027 0.569568
O  5.432503 -1.719281 -0.123084
O  -0.673135 2.887997 -0.111819
N  -1.302523 0.704655 -0.067257
C  1.036774 1.283685 0.148236
C  3.759071 0.659941 0.441834
C  -2.686724 0.798966 -0.160302
C  2.023049 2.254891 -0.042992
C  1.44879 0.000314 0.500147
C  -0.380574 1.708763 -0.015515
C  3.359421 1.952351 0.09763
C  2.78939 -0.321713 0.638269
C  -3.441316 -0.378413 -0.021113
C  -3.37591 1.991301 -0.391422
C  5.603276 -0.801545 0.892199
C  -4.827408 -0.348885 -0.108312
C  -4.757351 1.999807 -0.472655
C  -5.498128 0.840525 -0.33377
C  6.264792 -1.54372 -1.267194
C  7.669445 -2.069224 -1.058525
H  1.743048 3.265318 -0.308475
H  0.741096 -0.796782 0.692004
H  4.109191 2.718525 -0.055667
H  3.044456 -1.337794 0.902967
H  -0.940195 -0.236262 -0.037977
H  -2.837672 2.91527 -0.511956
H  6.65401 -0.610118 1.126934
H  5.112972 -1.203867 1.78287
H  -5.265839 2.93753 -0.652719
H  -6.576978 0.856058 -0.399909
H  5.77617 -2.096114 -2.071118
H  6.290447 -0.493585 -1.575648
H  7.66295 -3.123772 -0.779416
H  8.214191 -1.514588 -0.292869
H  8.232618 -1.973749 -1.98802
elementType: Cl O N C H
totalener: -1819.69093671 hartree
nucrepener: 1918.48798698 hartree
electener: -3738.17892369 hartree
oneelecener: -6308.07247316 hartree
twoeener: 2569.89354948 hartree
cpcmener: -0.02469650 hartree
kineticenergy: 1814.50945553 hartree
xcener: -128.535119745138 hartree
chargesum: 0.0000000
charge: -0.074402 -0.065769 -0.325080 -0.374323 -0.496530 -0.159586 -0.025389 0.312355 0.228328 -0.135602 -0.209825 0.461123 -0.235805 -0.177863 -0.077201 -0.225119 0.164036 0.096116 -0.134310 -0.177544 0.038456 -0.250229 0.143267 0.121090 0.139426 0.137271 0.166900 0.162225 0.125607 0.119022 0.159051 0.143551 0.094603 0.079344 0.082273 0.081005 0.089529
qa: -0.0744 -0.0658 -0.3251 -0.3743 -0.4965 -0.1596 -0.0254 0.3124 0.2283 -0.1356 -0.2098 0.4611 -0.2358 -0.1779 -0.0772 -0.2251 0.1640 0.0961 -0.1343 -0.1775 0.0385 -0.2502 0.1433 0.1211 0.1394 0.1373 0.1669 0.1622 0.1256 0.1190 0.1591 0.1436 0.0946 0.0793 0.0823 0.0810 0.0895
va: 1.2741 1.2530 2.0881 1.9459 2.0123 3.2749 3.6020 3.8147 3.7464 4.0154 4.0497 4.0239 4.0257 3.9133 3.9844 3.9571 3.9409 3.8892 3.9636 4.0040 3.9108 3.9229 1.0245 1.0210 1.0124 1.0177 1.0466 1.0351 0.9840 0.9856 0.9901 1.0056 0.9896 1.0012 1.0063 1.0037 1.0098
dispcorr: -0.015595730 hartree
energy: -1819.706532436835
dipole: 51.00857 -49.36014 1.64843 4.28714 -5.19812 -0.91098 -4.28932 4.19683 -0.09250
magnitude: 1.88567 au
magnitude: 4.79300 debye
