program: Orca
programVersion: 5.0.2
elementType: Cl Cl O O O N C C C C C C C C C C C C C C C C H H H H H H H H H H H H H H H
charge: 0
multiplicity: 1
keywords: wb97x-d3
keywords: def2-TZVPP
keywords: def2/J RIJCOSX
keywords: DEFGRID2
keywords: scfconv7
keywords: smallprint printgap noloewdin
keywords: NOSOSCF
formula: C16H15Cl2NO3
InChI: InChI=1/C16H15Cl2NO3/c1-2-21-10-22-12-8-6-11(7-9-12)16(20)19-14-5-3-4-13(17)15(14)18/h3-9,19H,2,10H2,1H3
37 atoms
Cl -2.662033 -1.589871 -1.148295
Cl -5.692488 -1.088996 -1.529905
O  4.965208 -0.856194 0.98578
O  5.613099 -1.021174 -1.256861
O  -0.527113 2.121716 1.789126
N  -1.256351 0.422778 0.455297
C  1.070216 0.555485 1.031063
C  3.690739 -0.426466 0.929059
C  -2.609205 0.701988 0.309377
C  1.509683 -0.201343 -0.051256
C  1.974513 0.829302 2.058596
C  -0.299883 1.121313 1.132553
C  2.806462 -0.68477 -0.117075
C  3.261104 0.337484 2.016692
C  -3.391682 -0.195096 -0.437201
C  -3.240086 1.819695 0.858708
C  5.485875 -1.670096 -0.04928
C  -4.751129 0.025575 -0.614605
C  -4.595748 2.022513 0.668511
C  -5.365715 1.136232 -0.062387
C  6.723714 -0.145156 -1.403947
C  6.517793 1.230745 -0.803087
H  0.859859 -0.402398 -0.89448
H  1.665401 1.421188 2.910097
H  3.101266 -1.24147 -0.994513
H  3.948103 0.540827 2.828531
H  -0.949241 -0.445121 0.042853
H  -2.677688 2.531972 1.437298
H  6.45059 -2.012785 0.338465
H  4.836382 -2.536062 -0.2086
H  -5.061065 2.896288 1.104263
H  -6.424364 1.302118 -0.204495
H  7.625681 -0.611657 -0.989252
H  6.876072 -0.054596 -2.480831
H  5.57879 1.673735 -1.138134
H  7.325796 1.887132 -1.1306
H  6.527378 1.22039 0.28624
elementType: Cl O N C H
totalener: -1819.69117507 hartree
nucrepener: 1935.52697695 hartree
electener: -3755.21815202 hartree
oneelecener: -6342.17742878 hartree
twoeener: 2586.95927676 hartree
cpcmener: -0.02442433 hartree
kineticenergy: 1814.52995307 hartree
xcener: -128.537353533155 hartree
chargesum: 0.0000000
charge: -0.074160 -0.065563 -0.324281 -0.368068 -0.493693 -0.156321 -0.006437 0.291782 0.230178 -0.219802 -0.146557 0.461367 -0.174585 -0.227636 -0.077702 -0.224179 0.146048 0.096090 -0.135636 -0.177210 0.044985 -0.264015 0.129524 0.142499 0.139285 0.139225 0.167487 0.161061 0.123864 0.123606 0.158712 0.142855 0.072491 0.095394 0.084296 0.099299 0.085797
qa: -0.0742 -0.0656 -0.3243 -0.3681 -0.4937 -0.1563 -0.0064 0.2918 0.2302 -0.2198 -0.1466 0.4614 -0.1746 -0.2276 -0.0777 -0.2242 0.1460 0.0961 -0.1356 -0.1772 0.0450 -0.2640 0.1295 0.1425 0.1393 0.1392 0.1675 0.1611 0.1239 0.1236 0.1587 0.1429 0.0725 0.0954 0.0843 0.0993 0.0858
va: 1.2732 1.2532 2.0712 1.9506 2.0133 3.2603 3.5862 3.8181 3.7597 4.0491 4.0211 4.0124 3.9086 4.0248 3.9807 3.9552 3.9484 3.8907 3.9628 4.0017 3.9017 3.9001 1.0252 1.0213 1.0208 1.0123 1.0442 1.0363 0.9903 0.9867 0.9903 1.0056 1.0003 0.9898 1.0075 1.0107 1.0074
dispcorr: -0.016392894 hartree
energy: -1819.707567962947
dipole: 48.83515 -47.29586 1.53928 9.43553 -10.20672 -0.77119 4.39387 -4.90192 -0.50804
magnitude: 1.79506 au
magnitude: 4.56268 debye
