program: Orca
programVersion: 5.0.2
elementType: Cl Cl O O O N C C C C C C C C C C C C C C C C H H H H H H H H H H H H H H H
charge: 0
multiplicity: 1
keywords: wb97x-d3
keywords: def2-TZVPP
keywords: def2/J RIJCOSX
keywords: DEFGRID2
keywords: scfconv7
keywords: smallprint printgap noloewdin
keywords: NOSOSCF
formula: C16H15Cl2NO3
InChI: InChI=1/C16H15Cl2NO3/c1-2-21-10-22-12-8-6-11(7-9-12)16(20)19-14-5-3-4-13(17)15(14)18/h3-9,19H,2,10H2,1H3
37 atoms
Cl -2.703428 -1.878525 0.270148
Cl -5.769198 -1.638159 0.649479
O  4.973593 -0.196974 -0.95913
O  5.53837 -1.27033 1.034057
O  -0.586992 2.751115 -0.745281
N  -1.320399 0.635562 -0.316008
C  1.026493 1.027973 -0.641679
C  3.67917 0.143595 -0.80223
C  -2.686572 0.808299 -0.132401
C  1.450075 -0.096927 0.060792
C  1.961819 1.714797 -1.417977
C  -0.356739 1.568289 -0.570018
C  2.761911 -0.539414 -0.006072
C  3.264815 1.275325 -1.507998
C  -3.461482 -0.330552 0.145525
C  -3.337404 2.041018 -0.206348
C  5.484601 -1.363133 -0.34129
C  -4.834286 -0.22864 0.325682
C  -4.705803 2.12277 -0.014523
C  -5.468429 0.999458 0.248124
C  6.516879 -0.381454 1.5680
C  7.923441 -0.94117 1.513519
H  0.77611 -0.638343 0.714075
H  1.664684 2.595947 -1.971486
H  3.042978 -1.400941 0.581844
H  3.976606 1.805747 -2.128216
H  -1.009161 -0.323606 -0.318139
H  -2.779306 2.937176 -0.416564
H  4.861808 -2.229157 -0.582768
H  6.467599 -1.496117 -0.801166
H  -5.188304 3.088844 -0.076418
H  -6.537661 1.070506 0.390296
H  6.472901 0.592835 1.071657
H  6.222343 -0.220626 2.605753
H  8.605657 -0.245826 2.004601
H  8.28274 -1.076862 0.492616
H  7.992351 -1.898151 2.032238
elementType: Cl O N C H
totalener: -1819.69126254 hartree
nucrepener: 1919.41244002 hartree
electener: -3739.10370256 hartree
oneelecener: -6309.88934385 hartree
twoeener: 2570.78564129 hartree
cpcmener: -0.02448686 hartree
kineticenergy: 1814.51520247 hartree
xcener: -128.534865089896 hartree
chargesum: -0.0000000
charge: -0.074382 -0.065289 -0.326546 -0.373455 -0.492383 -0.158047 -0.006338 0.310569 0.229096 -0.220189 -0.149303 0.462117 -0.188623 -0.238156 -0.076317 -0.222006 0.159692 0.094734 -0.136217 -0.176631 0.038028 -0.253232 0.131763 0.142215 0.140724 0.139638 0.168083 0.161190 0.121153 0.126070 0.158659 0.143007 0.078899 0.095213 0.089958 0.082848 0.083458
qa: -0.0744 -0.0653 -0.3265 -0.3735 -0.4924 -0.1580 -0.0063 0.3106 0.2291 -0.2202 -0.1493 0.4621 -0.1886 -0.2382 -0.0763 -0.2220 0.1597 0.0947 -0.1362 -0.1766 0.0380 -0.2532 0.1318 0.1422 0.1407 0.1396 0.1681 0.1612 0.1212 0.1261 0.1587 0.1430 0.0789 0.0952 0.0900 0.0828 0.0835
va: 1.2732 1.2535 2.0808 1.9440 2.0140 3.2549 3.5879 3.8186 3.7576 4.0391 4.0261 4.0112 3.9152 4.0343 3.9813 3.9579 3.9351 3.8935 3.9644 4.0011 3.9094 3.9224 1.0252 1.0208 1.0214 1.0122 1.0428 1.0360 0.9876 0.9842 0.9904 1.0056 1.0013 0.9892 1.0095 1.0032 1.0059
dispcorr: -0.015723362 hartree
energy: -1819.706985902618
dipole: 51.92102 -50.41593 1.50510 7.10278 -7.96483 -0.86204 2.13953 -1.98187 0.15766
magnitude: 1.74163 au
magnitude: 4.42688 debye
