program: Orca
programVersion: 5.0.2
elementType: Cl Cl O O O N C C C C C C C C C C C C C C C C H H H H H H H H H H H H H H H
charge: 0
multiplicity: 1
keywords: wb97x-d3
keywords: def2-TZVPP
keywords: def2/J RIJCOSX
keywords: DEFGRID2
keywords: scfconv7
keywords: smallprint printgap noloewdin
keywords: NOSOSCF
formula: C16H15Cl2NO3
InChI: InChI=1/C16H15Cl2NO3/c1-2-21-10-22-12-8-6-11(7-9-12)16(20)19-14-5-3-4-13(17)15(14)18/h3-9,19H,2,10H2,1H3
37 atoms
Cl -2.611246 -1.880327 0.299803
Cl -5.66738 -1.645046 0.755933
O  5.007535 -0.2203 -1.202268
O  5.600468 -1.37601 0.739035
O  -0.535639 2.746841 -0.800558
N  -1.247062 0.635836 -0.316511
C  1.084268 1.027958 -0.734308
C  3.722478 0.128896 -0.99758
C  -2.608603 0.806319 -0.099309
C  1.529438 -0.096728 -0.045792
C  1.991914 1.709633 -1.546893
C  -0.295966 1.566844 -0.616815
C  2.834361 -0.547687 -0.163915
C  3.288605 1.263334 -1.686816
C  -3.374735 -0.333668 0.196256
C  -3.263241 2.038083 -0.157608
C  5.518007 -1.411465 -0.636507
C  -4.74308 -0.234058 0.409851
C  -4.626718 2.117168 0.066282
C  -5.381226 0.992627 0.347417
C  6.565985 -0.478245 1.272834
C  6.558102 -0.612235 2.775395
H  0.87957 -0.632329 0.635801
H  1.677064 2.591917 -2.089146
H  3.133225 -1.408908 0.414996
H  3.979006 1.790049 -2.333943
H  -0.931764 -0.321801 -0.311701
H  -2.711727 2.935231 -0.380883
H  4.884567 -2.262515 -0.902855
H  6.499575 -1.532405 -1.105909
H  -5.111914 3.082655 0.016157
H  -6.446724 1.062402 0.516279
H  7.557761 -0.714015 0.868631
H  6.338395 0.554544 0.991048
H  7.287838 0.07211 3.208812
H  6.819121 -1.6228 3.092518
H  5.581658 -0.361375 3.192294
elementType: Cl O N C H
totalener: -1819.69298789 hartree
nucrepener: 1926.08356616 hartree
electener: -3745.77655405 hartree
oneelecener: -6323.20173349 hartree
twoeener: 2577.42517944 hartree
cpcmener: -0.02407616 hartree
kineticenergy: 1814.52785328 hartree
xcener: -128.536206265502 hartree
chargesum: -0.0000000
charge: -0.074430 -0.065266 -0.326798 -0.365490 -0.493195 -0.157923 -0.004586 0.305855 0.229143 -0.223038 -0.150435 0.462228 -0.184455 -0.234644 -0.076112 -0.222231 0.153477 0.095011 -0.135937 -0.177048 0.041247 -0.249265 0.132018 0.142377 0.142109 0.140079 0.167682 0.161272 0.124492 0.122703 0.158612 0.143188 0.081041 0.084795 0.084226 0.083487 0.085815
qa: -0.0744 -0.0653 -0.3268 -0.3655 -0.4932 -0.1579 -0.0046 0.3059 0.2291 -0.2230 -0.1504 0.4622 -0.1845 -0.2346 -0.0761 -0.2222 0.1535 0.0950 -0.1359 -0.1770 0.0412 -0.2493 0.1320 0.1424 0.1421 0.1401 0.1677 0.1613 0.1245 0.1227 0.1586 0.1432 0.0810 0.0848 0.0842 0.0835 0.0858
va: 1.2732 1.2535 2.0725 1.9489 2.0135 3.2568 3.5881 3.8187 3.7586 4.0346 4.0269 4.0122 3.8989 4.0326 3.9806 3.9575 3.9368 3.8933 3.9638 4.0015 3.8873 3.9510 1.0251 1.0210 1.0234 1.0120 1.0436 1.0360 0.9884 0.9910 0.9904 1.0055 0.9934 0.9882 1.0083 1.0044 1.0035
dispcorr: -0.015668338 hartree
energy: -1819.708656232141
dipole: 48.39855 -46.97373 1.42482 7.75441 -8.59958 -0.84517 4.04199 -3.87243 0.16956
magnitude: 1.66529 au
magnitude: 4.23282 debye
