program: Orca
programVersion: 5.0.2
elementType: Cl Cl O O O N C C C C C C C C C C C C C C C C H H H H H H H H H H H H H H H
charge: 0
multiplicity: 1
keywords: wb97x-d3
keywords: def2-TZVPP
keywords: def2/J RIJCOSX
keywords: DEFGRID2
keywords: scfconv7
keywords: smallprint printgap noloewdin
keywords: NOSOSCF
formula: C16H15Cl2NO3
InChI: InChI=1/C16H15Cl2NO3/c1-2-21-10-22-12-8-6-11(7-9-12)16(20)19-14-5-3-4-13(17)15(14)18/h3-9,19H,2,10H2,1H3
37 atoms
Cl -2.521723 -1.858969 0.431067
Cl -5.582087 -1.713228 0.890065
O  5.038765 0.102656 -1.23131
O  5.804448 -0.715776 0.733822
O  -0.661798 2.766692 -1.018959
N  -1.255567 0.673605 -0.341278
C  1.051411 1.153911 -0.819837
C  3.736156 0.398371 -1.034375
C  -2.623281 0.798258 -0.130611
C  1.917005 1.832881 -1.679393
C  1.563466 0.10822 -0.056662
C  -0.356861 1.62267 -0.735345
C  3.237336 1.455731 -1.796062
C  2.894097 -0.268022 -0.148049
C  -3.343464 -0.351375 0.236912
C  -3.326443 1.997558 -0.257745
C  5.604117 -1.011706 -0.609278
C  -4.714095 -0.291503 0.45165
C  -4.691669 2.037006 -0.034149
C  -5.400683 0.90277 0.316321
C  6.428516 -1.775156 1.437552
C  6.486501 -1.422676 2.904443
H  1.551498 2.656877 -2.277827
H  0.945647 -0.418039 0.660888
H  3.89507 1.976541 -2.480542
H  3.249184 -1.064734 0.489976
H  -0.893448 -0.264247 -0.262077
H  -2.811701 2.901514 -0.534092
H  4.969883 -1.90209 -0.736006
H  6.552416 -1.187109 -1.129692
H  -5.214008 2.978165 -0.1403
H  -6.467916 0.940238 0.483283
H  5.870187 -2.709973 1.296196
H  7.440072 -1.94571 1.045824
H  5.487236 -1.310999 3.327977
H  7.038338 -0.496327 3.071938
H  6.995414 -2.216776 3.451367
elementType: Cl O N C H
totalener: -1819.68999977 hartree
nucrepener: 1917.56446792 hartree
electener: -3737.25446769 hartree
oneelecener: -6306.11249800 hartree
twoeener: 2568.85803031 hartree
cpcmener: -0.02685630 hartree
kineticenergy: 1814.52104317 hartree
xcener: -128.534868779301 hartree
chargesum: 0.0000000
charge: -0.074741 -0.065703 -0.310969 -0.356875 -0.491387 -0.156937 -0.001294 0.308496 0.229075 -0.146930 -0.223663 0.462546 -0.231910 -0.178581 -0.078470 -0.223290 0.103524 0.096922 -0.136246 -0.177288 0.052721 -0.245873 0.142365 0.131078 0.141429 0.142813 0.166346 0.162287 0.120432 0.122378 0.158793 0.143444 0.077913 0.084082 0.084520 0.084539 0.084455
qa: -0.0747 -0.0657 -0.3110 -0.3569 -0.4914 -0.1569 -0.0013 0.3085 0.2291 -0.1469 -0.2237 0.4625 -0.2319 -0.1786 -0.0785 -0.2233 0.1035 0.0969 -0.1362 -0.1773 0.0527 -0.2459 0.1424 0.1311 0.1414 0.1428 0.1663 0.1623 0.1204 0.1224 0.1588 0.1434 0.0779 0.0841 0.0845 0.0845 0.0845
va: 1.2723 1.2529 2.1037 1.9155 2.0151 3.2614 3.5899 3.8116 3.7622 4.0297 4.0440 4.0099 4.0256 3.8855 3.9813 3.9550 3.9846 3.8921 3.9634 4.0015 3.8715 3.9506 1.0216 1.0256 1.0116 1.0121 1.0441 1.0357 0.9796 0.9915 0.9904 1.0054 0.9899 0.9921 1.0038 1.0053 1.0078
dispcorr: -0.015221138 hartree
energy: -1819.705220906355
dipole: 47.29018 -46.06401 1.22618 2.84501 -4.67268 -1.82767 4.06054 -3.70398 0.35656
magnitude: 2.22958 au
magnitude: 5.66714 debye
