program: Orca
programVersion: 5.0.2
elementType: Cl Cl O O O N C C C C C C C C C C C C C C C C H H H H H H H H H H H H H H H
charge: 0
multiplicity: 1
keywords: wb97x-d3
keywords: def2-TZVPP
keywords: def2/J RIJCOSX
keywords: DEFGRID2
keywords: scfconv7
keywords: smallprint printgap noloewdin
keywords: NOSOSCF
formula: C16H15Cl2NO3
InChI: InChI=1/C16H15Cl2NO3/c1-2-21-10-22-12-8-6-11(7-9-12)16(20)19-14-5-3-4-13(17)15(14)18/h3-9,19H,2,10H2,1H3
37 atoms
Cl -3.003927 -1.887828 -0.294046
Cl -6.046002 -1.370555 0.040445
O  4.748946 -1.092161 -1.035595
O  6.144218 -0.582886 0.672828
O  -0.319772 2.532048 0.131454
N  -1.313475 0.49102 -0.106423
C  1.06647 0.677491 -0.348149
C  3.584602 -0.464506 -0.765629
C  -2.662825 0.783103 0.038342
C  1.205406 -0.4851 -1.106277
C  2.212405 1.263178 0.176392
C  -0.239846 1.34449 -0.090164
C  2.447079 -1.047719 -1.319315
C  3.461506 0.696837 -0.006667
C  -3.577944 -0.279475 -0.028633
C  -3.161411 2.070446 0.243209
C  5.954103 -0.494316 -0.698275
C  -4.94038 -0.055927 0.113656
C  -4.523284 2.274319 0.373873
C  -5.423055 1.226192 0.314003
C  7.37273 -0.04312 1.099117
C  7.468887 -0.170158 2.601889
H  0.348022 -0.949878 -1.578937
H  2.122136 2.171747 0.756132
H  2.551039 -1.938627 -1.924047
H  4.316595 1.155854 0.467052
H  -1.096261 -0.490545 -0.162045
H  -2.481308 2.902727 0.303588
H  6.723713 -1.053528 -1.245884
H  5.982648 0.556221 -1.037278
H  -4.889085 3.279752 0.531048
H  -6.485367 1.390667 0.420826
H  8.211355 -0.569455 0.620689
H  7.456444 1.013792 0.804743
H  8.416752 0.238511 2.950803
H  7.415558 -1.212903 2.912794
H  6.664708 0.374406 3.09598
totalener: -1819.66769770 hartree
nucrepener: 1910.43766531 hartree
electener: -3730.10536301 hartree
oneelecener: -6291.46447308 hartree
twoeener: 2561.35911007 hartree
kineticenergy: 1814.57131562 hartree
xcener: -128.540264115517 hartree
chargesum: 0.0000000
charge: -0.072320 -0.052154 -0.280301 -0.302057 -0.403104 -0.180642 -0.001773 0.280092 0.208310 -0.172446 -0.169134 0.413081 -0.186549 -0.135506 -0.077724 -0.190584 0.081507 0.086107 -0.101696 -0.159238 0.039300 -0.228563 0.111752 0.130092 0.121975 0.111375 0.142948 0.157356 0.103867 0.098614 0.128625 0.118871 0.069574 0.064760 0.074136 0.087315 0.084136
qa: -0.0723 -0.0522 -0.2803 -0.3021 -0.4031 -0.1806 -0.0018 0.2801 0.2083 -0.1724 -0.1691 0.4131 -0.1865 -0.1355 -0.0777 -0.1906 0.0815 0.0861 -0.1017 -0.1592 0.0393 -0.2286 0.1118 0.1301 0.1220 0.1114 0.1429 0.1574 0.1039 0.0986 0.1286 0.1189 0.0696 0.0648 0.0741 0.0873 0.0841
va: 1.2777 1.2668 2.1400 1.9580 2.1010 3.2404 3.6751 3.9029 3.8096 4.0277 4.0853 4.0483 4.0495 3.8824 3.9762 4.0052 4.0352 3.9542 3.9717 4.0291 3.9017 3.9593 1.0307 1.0286 1.0177 1.0229 1.0728 1.0395 0.9925 0.9809 1.0002 1.0143 0.9928 0.9896 1.0085 1.0073 1.0063
dispcorr: -0.015246469 hartree
energy: -1819.682944166001
dipole: 54.80264 -53.22836 1.57428 10.84560 -10.81686 0.02874 6.82553 -6.86220 -0.03666
magnitude: 1.57497 au
magnitude: 4.00326 debye
