program: Orca
programVersion: 5.0.2
elementType: Cl Cl O O O N C C C C C C C C C C C C C C C C H H H H H H H H H H H H H H H
charge: 0
multiplicity: 1
keywords: wb97x-d3
keywords: def2-TZVPP
keywords: def2/J RIJCOSX
keywords: DEFGRID2
keywords: scfconv7
keywords: smallprint printgap noloewdin
keywords: NOSOSCF
formula: C16H15Cl2NO3
InChI: InChI=1/C16H15Cl2NO3/c1-2-21-10-22-12-8-6-11(7-9-12)16(20)19-14-5-3-4-13(17)15(14)18/h3-9,19H,2,10H2,1H3
37 atoms
Cl -2.705079 -1.910683 0.229465
Cl -5.806663 -1.836431 0.227746
O  4.941327 0.233976 0.327734
O  6.723756 -1.089763 0.756837
O  -0.742956 2.859277 -0.309601
N  -1.403072 0.682013 -0.144445
C  0.936194 1.224938 -0.010801
C  3.630457 0.498173 0.250046
C  -2.78799 0.775446 -0.152289
C  1.952696 2.065711 -0.468854
C  1.297946 0.031656 0.601828
C  -0.471269 1.688064 -0.164587
C  3.276196 1.708707 -0.351271
C  2.627812 -0.338096 0.736717
C  -3.528397 -0.405479 0.016202
C  -3.485004 1.973029 -0.315899
C  5.366931 -1.010278 0.849749
C  -4.916135 -0.381195 0.01886
C  -4.868279 1.977744 -0.305745
C  -5.596439 0.813866 -0.141326
C  7.236215 -1.241941 -0.556007
C  8.703612 -1.588721 -0.461295
H  1.691033 3.01017 -0.926077
H  0.551629 -0.628043 1.028615
H  4.05725 2.361127 -0.718363
H  2.856179 -1.268467 1.23761
H  -1.043355 -0.25755 -0.149295
H  -2.942089 2.892613 -0.452094
H  5.108268 -1.083171 1.911987
H  4.864485 -1.823791 0.297656
H  -5.389357 2.916728 -0.433623
H  -6.676681 0.823189 -0.136527
H  6.690551 -2.038034 -1.081799
H  7.101194 -0.32229 -1.133659
H  9.122416 -1.705718 -1.46051
H  8.857451 -2.521282 0.080698
H  9.262311 -0.802524 0.045641
totalener: -1819.66902953 hartree
nucrepener: 1897.98681413 hartree
electener: -3717.65584365 hartree
oneelecener: -6266.27748240 hartree
twoeener: 2548.62163874 hartree
kineticenergy: 1814.57195729 hartree
xcener: -128.540581483239 hartree
chargesum: 0.0000000
charge: -0.074467 -0.051622 -0.273385 -0.299435 -0.403613 -0.180662 -0.016415 0.313939 0.207858 -0.116989 -0.211157 0.419752 -0.192659 -0.185025 -0.075682 -0.189144 0.083225 0.085893 -0.098746 -0.160482 0.050438 -0.229019 0.133274 0.106495 0.123389 0.109725 0.141035 0.156706 0.112524 0.084915 0.128766 0.119657 0.054016 0.085241 0.073576 0.080218 0.087860
qa: -0.0745 -0.0516 -0.2734 -0.2994 -0.4036 -0.1807 -0.0164 0.3139 0.2079 -0.1170 -0.2112 0.4198 -0.1927 -0.1850 -0.0757 -0.1891 0.0832 0.0859 -0.0987 -0.1605 0.0504 -0.2290 0.1333 0.1065 0.1234 0.1097 0.1410 0.1567 0.1125 0.0849 0.1288 0.1197 0.0540 0.0852 0.0736 0.0802 0.0879
va: 1.2763 1.2675 2.0986 2.0579 2.1003 3.2450 3.6852 3.8759 3.8022 4.0476 4.0929 4.0456 4.0049 3.9427 3.9735 4.0082 4.0562 3.9584 3.9688 4.0297 3.8747 3.9588 1.0249 1.0370 1.0153 1.0199 1.0747 1.0391 0.9806 0.9811 1.0001 1.0141 0.9933 0.9922 1.0084 1.0075 1.0066
dispcorr: -0.014964764 hartree
energy: -1819.683994288901
dipole: 52.61333 -51.77426 0.83907 4.57967 -5.37881 -0.79914 -3.02208 2.74849 -0.27360
magnitude: 1.19059 au
magnitude: 3.02625 debye
