program: Orca
programVersion: 5.0.2
elementType: Cl Cl O O O N C C C C C C C C C C C C C C C C H H H H H H H H H H H H H H H
charge: 0
multiplicity: 1
keywords: wb97x-d3
keywords: def2-TZVPP
keywords: def2/J RIJCOSX
keywords: DEFGRID2
keywords: scfconv7
keywords: smallprint printgap noloewdin
keywords: NOSOSCF
formula: C16H15Cl2NO3
InChI: InChI=1/C16H15Cl2NO3/c1-2-21-10-22-12-8-6-11(7-9-12)16(20)19-14-5-3-4-13(17)15(14)18/h3-9,19H,2,10H2,1H3
37 atoms
Cl -2.439557 -1.842472 0.335406
Cl -5.540259 -1.921871 0.315413
O  5.097995 0.566218 -0.027804
O  5.301536 -1.654599 0.654765
O  -0.712622 2.935171 -0.701662
N  -1.262357 0.798672 -0.115822
C  1.049668 1.437319 -0.214987
C  3.768679 0.796462 -0.031867
C  -2.649959 0.821271 -0.136202
C  1.999528 2.1456 -0.950163
C  1.49222 0.428646 0.632516
C  -0.381316 1.821295 -0.363718
C  3.336953 1.825271 -0.869879
C  2.834935 0.098442 0.729579
C  -3.333223 -0.387753 0.070417
C  -3.40419 1.977308 -0.341515
C  5.649404 -0.343407 0.892824
C  -4.720798 -0.431511 0.065953
C  -4.785967 1.91424 -0.339231
C  -5.457725 0.722445 -0.139165
C  5.831485 -2.242749 -0.522424
C  7.288014 -2.642767 -0.379347
H  1.678923 2.951928 -1.595617
H  0.79686 -0.114184 1.26207
H  4.067512 2.370928 -1.452435
H  3.122594 -0.711825 1.382602
H  -0.854047 -0.113601 0.005162
H  -2.907826 2.917816 -0.508409
H  6.727991 -0.16802 0.8244
H  5.317109 -0.112403 1.91017
H  -5.350997 2.82201 -0.500998
H  -6.537096 0.678906 -0.141271
H  5.220031 -3.127397 -0.702405
H  5.697211 -1.583621 -1.38602
H  7.947533 -1.784477 -0.246022
H  7.617669 -3.161326 -1.279884
H  7.430127 -3.31517 0.466359
totalener: -1819.67009792 hartree
nucrepener: 1926.65937923 hartree
electener: -3746.32947716 hartree
oneelecener: -6323.95774620 hartree
twoeener: 2577.62826904 hartree
kineticenergy: 1814.57682415 hartree
xcener: -128.542942035235 hartree
chargesum: -0.0000000
charge: -0.073112 -0.052331 -0.296502 -0.324971 -0.401173 -0.178818 -0.002328 0.269948 0.207597 -0.118300 -0.224534 0.412350 -0.199981 -0.145582 -0.078170 -0.191021 0.137623 0.088269 -0.099878 -0.161225 0.020653 -0.239733 0.131339 0.113202 0.120737 0.122922 0.142127 0.156194 0.106735 0.102908 0.128367 0.119278 0.088713 0.077330 0.070900 0.082382 0.088085
qa: -0.0731 -0.0523 -0.2965 -0.3250 -0.4012 -0.1788 -0.0023 0.2699 0.2076 -0.1183 -0.2245 0.4123 -0.2000 -0.1456 -0.0782 -0.1910 0.1376 0.0883 -0.0999 -0.1612 0.0207 -0.2397 0.1313 0.1132 0.1207 0.1229 0.1421 0.1562 0.1067 0.1029 0.1284 0.1193 0.0887 0.0773 0.0709 0.0824 0.0881
va: 1.2761 1.2669 2.1037 1.9824 2.1024 3.2393 3.6760 3.9140 3.8136 4.0452 4.0536 4.0514 4.0334 3.9348 3.9727 4.0062 3.9934 3.9538 3.9697 4.0293 3.9350 3.9227 1.0241 1.0336 1.0170 1.0300 1.0730 1.0390 0.9867 0.9917 1.0003 1.0141 0.9905 1.0006 1.0063 1.0127 1.0056
dispcorr: -0.015751211 hartree
energy: -1819.685849135765
dipole: 48.45036 -47.10432 1.34603 2.77941 -3.38457 -0.60517 -2.56465 2.64275 0.07810
magnitude: 1.47788 au
magnitude: 3.75648 debye
