program: Orca
programVersion: 5.0.2
elementType: Cl Cl O O O N C C C C C C C C C C C C C C C C H H H H H H H H H H H H H H H
charge: 0
multiplicity: 1
keywords: wb97x-d3
keywords: def2-TZVPP
keywords: def2/J RIJCOSX
keywords: DEFGRID2
keywords: scfconv7
keywords: smallprint printgap noloewdin
keywords: NOSOSCF
formula: C16H15Cl2NO3
InChI: InChI=1/C16H15Cl2NO3/c1-2-21-10-22-12-8-6-11(7-9-12)16(20)19-14-5-3-4-13(17)15(14)18/h3-9,19H,2,10H2,1H3
37 atoms
Cl -2.885806 -1.80873 0.633159
Cl -5.95392 -1.361269 0.77221
O  4.79172 -1.055528 -0.68707
O  6.283924 0.346523 0.43311
O  -0.443908 2.524639 -0.835925
N  -1.330953 0.516024 -0.214496
C  1.030813 0.689819 -0.607283
C  3.601701 -0.420079 -0.649333
C  -2.692676 0.777441 -0.163526
C  2.158145 1.488247 -0.454538
C  1.214767 -0.67885 -0.80577
C  -0.304123 1.349946 -0.578396
C  3.433176 0.949905 -0.456194
C  2.480098 -1.228183 -0.829964
C  -3.548334 -0.264328 0.228467
C  -3.260688 2.010129 -0.487709
C  5.984916 -0.310498 -0.74024
C  -4.921675 -0.072983 0.291731
C  -4.631808 2.18096 -0.421183
C  -5.473317 1.154535 -0.03347
C  6.632769 -0.471222 1.539396
C  8.062847 -0.975175 1.474561
H  2.034252 2.553526 -0.314579
H  0.373403 -1.337494 -0.986796
H  4.274685 1.604104 -0.282271
H  2.614649 -2.287819 -1.002243
H  -1.063874 -0.396905 0.113879
H  -2.627663 2.827975 -0.786497
H  6.744667 -1.046989 -1.021713
H  5.926166 0.454977 -1.520519
H  -5.052133 3.143773 -0.677629
H  -6.543253 1.294588 0.018498
H  6.50219 0.16027 2.418424
H  5.935188 -1.308366 1.644342
H  8.232393 -1.645527 0.630998
H  8.296843 -1.535527 2.380024
H  8.768744 -0.148628 1.399222
totalener: -1819.67021303 hartree
nucrepener: 1915.74193996 hartree
electener: -3735.41215299 hartree
oneelecener: -6302.13682440 hartree
twoeener: 2566.72467141 hartree
kineticenergy: 1814.56746050 hartree
xcener: -128.541298645155 hartree
chargesum: -0.0000000
charge: -0.073643 -0.052344 -0.298244 -0.324448 -0.403016 -0.180540 -0.006872 0.257800 0.208365 -0.169810 -0.172077 0.412725 -0.140027 -0.190929 -0.076686 -0.190630 0.138278 0.086284 -0.100915 -0.160579 0.018903 -0.237609 0.132191 0.111209 0.128482 0.120396 0.141516 0.157528 0.105556 0.105325 0.128726 0.119193 0.089081 0.076954 0.069834 0.081835 0.088186
qa: -0.0736 -0.0523 -0.2982 -0.3244 -0.4030 -0.1805 -0.0069 0.2578 0.2084 -0.1698 -0.1721 0.4127 -0.1400 -0.1909 -0.0767 -0.1906 0.1383 0.0863 -0.1009 -0.1606 0.0189 -0.2376 0.1322 0.1112 0.1285 0.1204 0.1415 0.1575 0.1056 0.1053 0.1287 0.1192 0.0891 0.0770 0.0698 0.0818 0.0882
va: 1.2766 1.2667 2.0982 1.9833 2.1015 3.2433 3.6764 3.9322 3.8099 4.0791 4.0246 4.0532 3.8847 4.0603 3.9712 4.0050 3.9913 3.9550 3.9697 4.0286 3.9355 3.9227 1.0284 1.0311 1.0271 1.0182 1.0756 1.0391 0.9873 0.9921 1.0002 1.0141 0.9907 1.0011 1.0068 1.0128 1.0054
dispcorr: -0.015717496 hartree
energy: -1819.685930526901
dipole: 53.68030 -52.34095 1.33935 6.45665 -7.02566 -0.56902 0.01665 0.16794 0.18459
magnitude: 1.46687 au
magnitude: 3.72848 debye
