program: Orca
programVersion: 5.0.2
elementType: Cl Cl O O O N C C C C C C C C C C C C C C C C H H H H H H H H H H H H H H H
charge: 0
multiplicity: 1
keywords: wb97x-d3
keywords: def2-TZVPP
keywords: def2/J RIJCOSX
keywords: DEFGRID2
keywords: scfconv7
keywords: smallprint printgap noloewdin
keywords: NOSOSCF
formula: C16H15Cl2NO3
InChI: InChI=1/C16H15Cl2NO3/c1-2-21-10-22-12-8-6-11(7-9-12)16(20)19-14-5-3-4-13(17)15(14)18/h3-9,19H,2,10H2,1H3
37 atoms
Cl -2.661461 -1.87785 0.29574
Cl -5.732723 -1.657574 0.681086
O  4.982974 -0.171011 -0.93854
O  5.525889 -1.325087 1.013731
O  -0.604573 2.748098 -0.838732
N  -1.304922 0.642108 -0.304136
C  1.034076 1.055473 -0.651005
C  3.688225 0.17607 -0.785311
C  -2.671906 0.802688 -0.128924
C  1.461501 -0.046423 0.080961
C  1.96953 1.731093 -1.433966
C  -0.356465 1.586116 -0.607113
C  2.774847 -0.486576 0.030733
C  3.272707 1.292232 -1.51262
C  -3.436577 -0.338806 0.160488
C  -3.327902 2.031019 -0.2186
C  5.463863 -1.360542 -0.361978
C  -4.809696 -0.247954 0.342269
C  -4.695776 2.102544 -0.025595
C  -5.449113 0.97666 0.251659
C  6.47474 -0.431357 1.574953
C  7.897456 -0.955353 1.506398
H  0.786866 -0.563749 0.753085
H  1.662412 2.604747 -1.992277
H  3.0690 -1.314485 0.658205
H  3.98881 1.808398 -2.138212
H  -0.983843 -0.311654 -0.276357
H  -2.766516 2.921577 -0.443153
H  4.818227 -2.205468 -0.623113
H  6.443018 -1.504653 -0.830266
H  -5.185151 3.064017 -0.098196
H  -6.51791 1.037392 0.396095
H  6.406687 0.556276 1.107866
H  6.174503 -0.309903 2.616184
H  8.567905 -0.264121 2.017454
H  8.25969 -1.052283 0.482297
H  7.983371 -1.927229 1.991522
totalener: -1819.67028350 hartree
nucrepener: 1922.11986327 hartree
electener: -3741.79014677 hartree
oneelecener: -6314.87475589 hartree
twoeener: 2573.08460912 hartree
kineticenergy: 1814.57487256 hartree
xcener: -128.542663108818 hartree
chargesum: -0.0000000
charge: -0.073500 -0.052104 -0.296528 -0.325353 -0.401975 -0.179235 -0.002151 0.268955 0.208070 -0.226081 -0.120212 0.414421 -0.147499 -0.197012 -0.077855 -0.190036 0.135551 0.087250 -0.100195 -0.160893 0.020853 -0.240177 0.111589 0.131309 0.125771 0.120855 0.142824 0.156981 0.103201 0.107529 0.128135 0.119022 0.077643 0.089241 0.082456 0.071058 0.088093
qa: -0.0735 -0.0521 -0.2965 -0.3254 -0.4020 -0.1792 -0.0022 0.2690 0.2081 -0.2261 -0.1202 0.4144 -0.1475 -0.1970 -0.0779 -0.1900 0.1356 0.0872 -0.1002 -0.1609 0.0209 -0.2402 0.1116 0.1313 0.1258 0.1209 0.1428 0.1570 0.1032 0.1075 0.1281 0.1190 0.0776 0.0892 0.0825 0.0711 0.0881
va: 1.2763 1.2672 2.1034 1.9831 2.1022 3.2409 3.6672 3.9167 3.8119 4.0617 4.0514 4.0499 3.9382 4.0295 3.9719 4.0053 3.9947 3.9556 3.9692 4.0289 3.9325 3.9227 1.0345 1.0244 1.0288 1.0170 1.0728 1.0393 0.9919 0.9868 1.0004 1.0142 1.0009 0.9906 1.0125 1.0065 1.0054
dispcorr: -0.015759479 hartree
energy: -1819.686042979340
dipole: 51.56671 -50.19745 1.36925 7.11655 -7.58690 -0.47035 2.05792 -1.88418 0.17374
magnitude: 1.45817 au
magnitude: 3.70638 debye
