program: Orca
programVersion: 5.0.2
elementType: Cl Cl O O O N C C C C C C C C C C C C C C C C H H H H H H H H H H H H H H H
charge: 0
multiplicity: 1
keywords: wb97x-d3
keywords: def2-TZVPP
keywords: def2/J RIJCOSX
keywords: DEFGRID2
keywords: scfconv7
keywords: smallprint printgap noloewdin
keywords: NOSOSCF
formula: C16H15Cl2NO3
InChI: InChI=1/C16H15Cl2NO3/c1-2-21-10-22-12-8-6-11(7-9-12)16(20)19-14-5-3-4-13(17)15(14)18/h3-9,19H,2,10H2,1H3
37 atoms
Cl -2.877346 -1.9070 -0.102304
Cl -5.936407 -1.514564 -0.463158
O  4.807199 -0.776977 0.97295
O  6.20121 0.146561 -0.651711
O  -0.452632 2.670641 0.162359
N  -1.332941 0.564952 0.152554
C  1.031354 0.854347 0.454981
C  3.611981 -0.184096 0.771181
C  -2.692103 0.79867 -0.003328
C  1.231178 -0.389744 1.053345
C  2.147659 1.572667 0.043208
C  -0.308316 1.472188 0.252899
C  2.502005 -0.901906 1.214356
C  3.427088 1.062928 0.176698
C  -3.541253 -0.311742 -0.136482
C  -3.263052 2.071913 -0.027669
C  5.993778 -0.073994 0.691602
C  -4.910316 -0.145333 -0.295008
C  -4.629905 2.217164 -0.182422
C  -5.464218 1.123029 -0.31908
C  6.492767 -0.997586 -1.438809
C  7.930808 -1.462915 -1.297403
H  0.398981 -0.965365 1.441333
H  2.010991 2.545163 -0.409862
H  2.650687 -1.859289 1.695877
H  4.257002 1.636798 -0.208311
H  -1.06118 -0.402567 0.096626
H  -2.634463 2.940554 0.067916
H  5.983186 0.909539 1.17207
H  6.778481 -0.684119 1.150745
H  -5.052209 3.212423 -0.199696
H  -6.530797 1.241443 -0.443066
H  5.800783 -1.815891 -1.214791
H  6.301634 -0.695479 -2.468915
H  8.159242 -1.819346 -0.292239
H  8.629212 -0.663025 -1.541738
H  8.117777 -2.292186 -1.980239
totalener: -1819.67025638 hartree
nucrepener: 1916.92682075 hartree
electener: -3736.59707713 hartree
oneelecener: -6304.51667859 hartree
twoeener: 2567.91960146 hartree
kineticenergy: 1814.57100335 hartree
xcener: -128.541923428207 hartree
chargesum: 0.0000000
charge: -0.073344 -0.052508 -0.297738 -0.323698 -0.402685 -0.181399 -0.006907 0.263062 0.206852 -0.173397 -0.170827 0.412998 -0.192400 -0.139944 -0.075583 -0.189026 0.137488 0.086374 -0.101825 -0.159633 0.020372 -0.238565 0.112479 0.132385 0.120407 0.125168 0.141948 0.157040 0.103802 0.106385 0.128442 0.118702 0.076293 0.089338 0.069987 0.087888 0.082070
qa: -0.0733 -0.0525 -0.2977 -0.3237 -0.4027 -0.1814 -0.0069 0.2631 0.2069 -0.1734 -0.1708 0.4130 -0.1924 -0.1399 -0.0756 -0.1890 0.1375 0.0864 -0.1018 -0.1596 0.0204 -0.2386 0.1125 0.1324 0.1204 0.1252 0.1419 0.1570 0.1038 0.1064 0.1284 0.1187 0.0763 0.0893 0.0700 0.0879 0.0821
va: 1.2764 1.2666 2.1026 1.9840 2.1010 3.2417 3.6777 3.9279 3.8148 4.0230 4.0837 4.0516 4.0577 3.8940 3.9696 4.0044 3.9952 3.9550 3.9724 4.0282 3.9359 3.9227 1.0299 1.0280 1.0182 1.0267 1.0744 1.0392 0.9912 0.9870 1.0003 1.0143 1.0008 0.9906 1.0066 1.0055 1.0127
dispcorr: -0.015704792 hartree
energy: -1819.685961173590
dipole: 53.18995 -51.84445 1.34550 5.79807 -6.40737 -0.60930 -2.11218 2.07804 -0.03414
magnitude: 1.47743 au
magnitude: 3.75532 debye
