program: Orca
programVersion: 5.0.2
elementType: Cl Cl O O O N C C C C C C C C C C C C C C C C H H H H H H H H H H H H H H H
charge: 0
multiplicity: 1
keywords: wb97x-d3
keywords: def2-TZVPP
keywords: def2/J RIJCOSX
keywords: DEFGRID2
keywords: scfconv7
keywords: smallprint printgap noloewdin
keywords: NOSOSCF
formula: C16H15Cl2NO3
InChI: InChI=1/C16H15Cl2NO3/c1-2-21-10-22-12-8-6-11(7-9-12)16(20)19-14-5-3-4-13(17)15(14)18/h3-9,19H,2,10H2,1H3
37 atoms
Cl -2.392246 -1.828492 0.315024
Cl -5.492712 -1.921878 0.34555
O  5.126593 0.580999 -0.499435
O  5.398247 -1.710716 -0.148039
O  -0.691926 3.007542 -0.494671
N  -1.234689 0.824235 -0.112229
C  1.070905 1.435664 -0.399766
C  3.793363 0.78461 -0.485894
C  -2.622429 0.842784 -0.105209
C  1.491268 0.152275 -0.729991
C  2.043717 2.399162 -0.133677
C  -0.358434 1.852489 -0.350999
C  2.835103 -0.185174 -0.769514
C  3.383148 2.079637 -0.166379
C  -3.296806 -0.372936 0.091279
C  -3.384842 1.997152 -0.288189
C  5.647176 -0.637275 -0.971576
C  -4.683871 -0.423963 0.104588
C  -4.766202 1.925488 -0.276285
C  -5.429204 0.728041 -0.080368
C  6.025103 -1.658766 1.12116
C  5.794367 -2.97472 1.825601
H  0.776957 -0.619108 -0.993212
H  1.738388 3.409563 0.101866
H  3.10778 -1.20336 -1.003925
H  4.132156 2.830714 0.047467
H  -0.821998 -0.061589 0.128454
H  -2.893777 2.943789 -0.435499
H  5.224318 -0.884931 -1.950813
H  6.720968 -0.443361 -1.080008
H  -5.338248 2.831846 -0.420417
H  -6.508257 0.678568 -0.06897
H  7.101476 -1.473079 1.001491
H  5.62225 -0.836464 1.721476
H  4.730553 -3.164196 1.966523
H  6.262958 -2.955645 2.809221
H  6.219335 -3.807117 1.26549
totalener: -1819.67214000 hartree
nucrepener: 1931.07265205 hartree
electener: -3750.74479205 hartree
oneelecener: -6332.72582732 hartree
twoeener: 2581.98103527 hartree
kineticenergy: 1814.57147287 hartree
xcener: -128.540847175771 hartree
chargesum: 0.0000000
charge: -0.073409 -0.052205 -0.294361 -0.319014 -0.403040 -0.179749 -0.006503 0.261559 0.208390 -0.215053 -0.120236 0.416092 -0.144955 -0.192512 -0.078387 -0.190361 0.127129 0.086610 -0.099908 -0.160420 0.034088 -0.232229 0.107183 0.131615 0.122922 0.121061 0.142495 0.157380 0.106291 0.105096 0.128450 0.119447 0.061559 0.083000 0.085288 0.074746 0.081940
qa: -0.0734 -0.0522 -0.2944 -0.3190 -0.4030 -0.1797 -0.0065 0.2616 0.2084 -0.2151 -0.1202 0.4161 -0.1450 -0.1925 -0.0784 -0.1904 0.1271 0.0866 -0.0999 -0.1604 0.0341 -0.2322 0.1072 0.1316 0.1229 0.1211 0.1425 0.1574 0.1063 0.1051 0.1284 0.1194 0.0616 0.0830 0.0853 0.0747 0.0819
va: 1.2769 1.2669 2.0944 1.9869 2.1013 3.2437 3.6738 3.9158 3.8067 4.0471 4.0501 4.0471 3.9215 4.0258 3.9749 4.0058 3.9993 3.9559 3.9691 4.0287 3.9143 3.9545 1.0367 1.0248 1.0298 1.0169 1.0735 1.0391 0.9916 0.9936 1.0003 1.0141 0.9954 0.9881 1.0057 1.0092 1.0068
dispcorr: -0.015667371 hartree
energy: -1819.687807373374
dipole: 44.98901 -43.73097 1.25804 2.43926 -2.99344 -0.55417 2.42143 -2.25757 0.16386
magnitude: 1.38442 au
magnitude: 3.51892 debye
