program: Orca
programVersion: 5.0.2
elementType: Cl Cl O O O N C C C C C C C C C C C C C C C C H H H H H H H H H H H H H H H
charge: 0
multiplicity: 1
keywords: wb97x-d3
keywords: def2-TZVPP
keywords: def2/J RIJCOSX
keywords: DEFGRID2
keywords: scfconv7
keywords: smallprint printgap noloewdin
keywords: NOSOSCF
formula: C16H15Cl2NO3
InChI: InChI=1/C16H15Cl2NO3/c1-2-21-10-22-12-8-6-11(7-9-12)16(20)19-14-5-3-4-13(17)15(14)18/h3-9,19H,2,10H2,1H3
37 atoms
Cl -2.597574 -1.878746 0.306692
Cl -5.651852 -1.647174 0.807893
O  5.00748 -0.194215 -1.165735
O  5.597989 -1.384584 0.753006
O  -0.565683 2.740198 -0.898296
N  -1.255178 0.635981 -0.34407
C  1.073894 1.043863 -0.758446
C  3.719243 0.156705 -0.973868
C  -2.614978 0.801067 -0.121264
C  1.51989 -0.058712 -0.039032
C  1.98683 1.71682 -1.569884
C  -0.313658 1.577726 -0.673345
C  2.829896 -0.503109 -0.129492
C  3.286093 1.274672 -1.688126
C  -3.372378 -0.33729 0.197958
C  -3.270463 2.031101 -0.191389
C  5.496694 -1.394133 -0.619087
C  -4.737345 -0.241512 0.43068
C  -4.630174 2.107317 0.051617
C  -5.376112 0.984678 0.360541
C  6.550125 -0.479821 1.284702
C  6.616243 -0.679039 2.781589
H  0.864342 -0.573237 0.653965
H  1.66436 2.591706 -2.117952
H  3.141889 -1.331635 0.48864
H  3.98462 1.78891 -2.335034
H  -0.935971 -0.318244 -0.321976
H  -2.7144 2.918798 -0.439703
H  4.843263 -2.232614 -0.881961
H  6.471461 -1.529226 -1.102557
H  -5.119334 3.070021 -0.006216
H  -6.438604 1.049013 0.545386
H  7.53429 -0.661067 0.829771
H  6.275433 0.55524 1.056118
H  7.348751 0.001663 3.214692
H  6.910285 -1.697271 3.035808
H  5.652663 -0.473288 3.24832
totalener: -1819.67222061 hartree
nucrepener: 1926.66328206 hartree
electener: -3746.33550266 hartree
oneelecener: -6323.92659997 hartree
twoeener: 2577.59109730 hartree
kineticenergy: 1814.57060236 hartree
xcener: -128.540346987593 hartree
chargesum: 0.0000000
charge: -0.073529 -0.052099 -0.294836 -0.319640 -0.402036 -0.179298 -0.001745 0.261742 0.208198 -0.226390 -0.121319 0.414843 -0.146390 -0.193403 -0.077627 -0.190028 0.128099 0.086941 -0.100129 -0.160809 0.031861 -0.233486 0.112145 0.131547 0.127213 0.121494 0.142881 0.157036 0.106128 0.104697 0.128214 0.119163 0.063092 0.084036 0.075049 0.082008 0.086378
qa: -0.0735 -0.0521 -0.2948 -0.3196 -0.4020 -0.1793 -0.0017 0.2617 0.2082 -0.2264 -0.1213 0.4148 -0.1464 -0.1934 -0.0776 -0.1900 0.1281 0.0869 -0.1001 -0.1608 0.0319 -0.2335 0.1121 0.1315 0.1272 0.1215 0.1429 0.1570 0.1061 0.1047 0.1282 0.1192 0.0631 0.0840 0.0750 0.0820 0.0864
va: 1.2764 1.2671 2.0952 1.9861 2.1022 3.2411 3.6662 3.9177 3.8112 4.0574 4.0515 4.0498 3.9249 4.0259 3.9719 4.0049 3.9994 3.9560 3.9692 4.0291 3.9131 3.9546 1.0343 1.0244 1.0293 1.0167 1.0730 1.0393 0.9920 0.9937 1.0004 1.0142 0.9951 0.9882 1.0093 1.0066 1.0054
dispcorr: -0.015664515 hartree
energy: -1819.687885120367
dipole: 48.40269 -47.12444 1.27824 7.65747 -8.12562 -0.46815 3.99619 -3.82919 0.16700
magnitude: 1.37148 au
magnitude: 3.48603 debye
