program: Orca
programVersion: 5.0.2
elementType: Cl Cl O O O N C C C C C C C C C C C C C C C C H H H H H H H H H H H H H H H
charge: 0
multiplicity: 1
keywords: wb97x-d3
keywords: def2-TZVPP
keywords: def2/J RIJCOSX
keywords: DEFGRID2
keywords: scfconv7
keywords: smallprint printgap noloewdin
keywords: NOSOSCF
formula: C16H15Cl2NO3
InChI: InChI=1/C16H15Cl2NO3/c1-2-21-10-22-12-8-6-11(7-9-12)16(20)19-14-5-3-4-13(17)15(14)18/h3-9,19H,2,10H2,1H3
37 atoms
Cl -2.880081 -1.839843 0.510872
Cl -5.935397 -1.355666 0.752686
O  4.775856 -1.120077 -0.915727
O  6.268128 0.130692 0.371549
O  -0.409616 2.531532 -0.790027
N  -1.310707 0.501796 -0.265447
C  1.044949 0.670224 -0.687912
C  3.596973 -0.470901 -0.825433
C  -2.667136 0.778727 -0.167492
C  2.183306 1.436176 -0.468542
C  1.207128 -0.679108 -1.002949
C  -0.280516 1.343278 -0.600019
C  3.450117 0.880218 -0.514542
C  2.463928 -1.243417 -1.076423
C  -3.52818 -0.268614 0.196876
C  -3.224607 2.033767 -0.416841
C  5.98223 -0.397712 -0.866016
C  -4.896251 -0.060836 0.306055
C  -4.590728 2.220498 -0.305637
C  -5.437701 1.188479 0.0549
C  6.499857 -0.817943 1.397519
C  6.943748 -0.080791 2.639598
H  2.075323 2.487555 -0.238131
H  0.354078 -1.304902 -1.237975
H  4.300855 1.504017 -0.282892
H  2.583293 -2.285764 -1.340832
H  -1.047786 -0.430799 0.007784
H  -2.586792 2.8562 -0.691976
H  6.73935 -1.12234 -1.188298
H  5.960312 0.44003 -1.570795
H  -5.002352 3.200739 -0.503754
H  -6.503657 1.340705 0.142338
H  5.592253 -1.39327 1.608333
H  7.270468 -1.534682 1.080948
H  7.12053 -0.789755 3.448115
H  6.17949 0.621488 2.972339
H  7.86686 0.472103 2.467538
totalener: -1819.67209339 hartree
nucrepener: 1921.14227623 hartree
electener: -3740.81436963 hartree
oneelecener: -6312.89652042 hartree
twoeener: 2572.08215079 hartree
kineticenergy: 1814.57183602 hartree
xcener: -128.540616260842 hartree
chargesum: -0.0000000
charge: -0.073369 -0.052376 -0.296190 -0.318637 -0.401764 -0.180751 -0.003463 0.252435 0.209189 -0.172180 -0.175125 0.412697 -0.137193 -0.188987 -0.078237 -0.190953 0.128125 0.087091 -0.100871 -0.160781 0.034273 -0.232574 0.132044 0.113614 0.127291 0.120987 0.141848 0.157572 0.104500 0.107181 0.128868 0.119313 0.082097 0.061666 0.074319 0.086115 0.082226
qa: -0.0734 -0.0524 -0.2962 -0.3186 -0.4018 -0.1808 -0.0035 0.2524 0.2092 -0.1722 -0.1751 0.4127 -0.1372 -0.1890 -0.0782 -0.1910 0.1281 0.0871 -0.1009 -0.1608 0.0343 -0.2326 0.1320 0.1136 0.1273 0.1210 0.1418 0.1576 0.1045 0.1072 0.1289 0.1193 0.0821 0.0617 0.0743 0.0861 0.0822
va: 1.2765 1.2667 2.0901 1.9871 2.1023 3.2409 3.6714 3.9282 3.8092 4.0780 4.0240 4.0528 3.8766 4.0569 3.9730 4.0055 3.9991 3.9552 3.9698 4.0292 3.9139 3.9544 1.0277 1.0303 1.0272 1.0180 1.0744 1.0391 0.9936 0.9918 1.0002 1.0141 0.9883 0.9953 1.0091 1.0058 1.0067
dispcorr: -0.015655169 hartree
energy: -1819.687748562898
dipole: 50.84205 -49.61136 1.23070 8.09253 -8.64105 -0.54853 2.78858 -2.62497 0.16361
magnitude: 1.35730 au
magnitude: 3.44998 debye
