program: Orca
programVersion: 5.0.2
elementType: Cl Cl O O O N C C C C C C C C C C C C C C C C H H H H H H H H H H H H H H H
charge: 0
multiplicity: 1
keywords: wb97x-d3
keywords: def2-TZVPP
keywords: def2/J RIJCOSX
keywords: DEFGRID2
keywords: scfconv7
keywords: smallprint printgap noloewdin
keywords: NOSOSCF
formula: C16H15Cl2NO3
InChI: InChI=1/C16H15Cl2NO3/c1-2-21-10-22-12-8-6-11(7-9-12)16(20)19-14-5-3-4-13(17)15(14)18/h3-9,19H,2,10H2,1H3
37 atoms
Cl -2.982007 -1.922404 0.04585
Cl -6.018282 -1.332934 0.301385
O  4.819391 -1.306315 -0.354675
O  6.500052 0.3217 -0.409958
O  -0.260683 2.486872 -0.214163
N  -1.271199 0.443412 -0.1330
C  1.126362 0.572046 -0.217108
C  3.654413 -0.628075 -0.329223
C  -2.615295 0.766135 -0.009058
C  2.220968 1.253692 -0.736092
C  1.327772 -0.716977 0.277349
C  -0.184515 1.2789 -0.182578
C  3.475448 0.672545 -0.797766
C  2.571756 -1.310526 0.223362
C  -3.539874 -0.286796 0.08096
C  -3.099643 2.074189 0.034591
C  5.93358 -0.767218 -1.026583
C  -4.898992 -0.031846 0.202413
C  -4.456864 2.307947 0.164493
C  -5.367064 1.270324 0.246845
C  7.230136 0.076512 0.77883
C  6.378328 0.056168 2.034984
H  2.089306 2.265794 -1.093972
H  0.523282 -1.270863 0.746925
H  4.2991 1.25338 -1.18602
H  2.7200 -2.30908 0.612466
H  -1.081437 -0.538057 -0.249261
H  -2.413358 2.900466 -0.037349
H  6.633033 -1.608574 -1.096431
H  5.651421 -0.449704 -2.035844
H  -4.811216 3.329149 0.196847
H  -6.42639 1.458591 0.343747
H  7.797428 -0.859516 0.687506
H  7.959831 0.885332 0.843173
H  7.025995 0.027859 2.912292
H  5.722216 -0.811041 2.078518
H  5.763947 0.953753 2.103885
totalener: -1819.67015400 hartree
nucrepener: 1930.74898195 hartree
electener: -3750.41913595 hartree
oneelecener: -6332.14858703 hartree
twoeener: 2581.72945108 hartree
kineticenergy: 1814.57349286 hartree
xcener: -128.541900167648 hartree
chargesum: 0.0000000
charge: -0.073296 -0.052470 -0.298129 -0.317974 -0.404010 -0.180756 -0.011369 0.254209 0.207373 -0.165237 -0.163476 0.413923 -0.140861 -0.187973 -0.076711 -0.188977 0.122198 0.086163 -0.101559 -0.159391 0.033573 -0.248332 0.133098 0.109016 0.127476 0.120172 0.141720 0.157752 0.104557 0.104792 0.128556 0.119178 0.054603 0.090575 0.088133 0.084881 0.088574
qa: -0.0733 -0.0525 -0.2981 -0.3180 -0.4040 -0.1808 -0.0114 0.2542 0.2074 -0.1652 -0.1635 0.4139 -0.1409 -0.1880 -0.0767 -0.1890 0.1222 0.0862 -0.1016 -0.1594 0.0336 -0.2483 0.1331 0.1090 0.1275 0.1202 0.1417 0.1578 0.1046 0.1048 0.1286 0.1192 0.0546 0.0906 0.0881 0.0849 0.0886
va: 1.2773 1.2665 2.0846 1.9904 2.1004 3.2461 3.6771 3.9138 3.8079 4.0781 4.0191 4.0532 3.8888 4.0581 3.9735 4.0046 4.0119 3.9553 3.9715 4.0287 3.9293 3.9027 1.0284 1.0316 1.0261 1.0184 1.0746 1.0393 0.9935 0.9915 1.0003 1.0142 1.0018 0.9913 1.0137 1.0092 1.0071
dispcorr: -0.016448445 hartree
energy: -1819.686602443200
dipole: 51.16058 -49.87291 1.28767 9.32453 -9.84329 -0.51876 3.75747 -3.70861 0.04886
magnitude: 1.38910 au
magnitude: 3.53081 debye
