program: Orca
programVersion: 5.0.2
elementType: O N N C C C C C C C C C C C C C C C C C H H H H H H H H H H H H H H H H H H H H
charge: 0
multiplicity: 1
keywords: wb97x-d3
keywords: def2-TZVPP
keywords: def2/J RIJCOSX
keywords: DEFGRID2
keywords: scfconv7
keywords: smallprint printgap noloewdin
keywords: NOSOSCF
formula: C17H20N2O
InChI: InChI=1/C17H20N2O/c1-13-9-11-15(12-10-13)18-16(20)19-17(2,3)14-7-5-4-6-8-14/h4-12,18-19H,1-3H3
40 atoms
O  1.227688 -0.984416 -1.8804
N  0.446548 -0.849918 0.244645
N  -0.98799 -0.722495 -1.575189
C  1.741589 -0.780839 0.919404
C  2.552652 0.394201 0.379482
C  2.472982 -2.119011 0.816373
C  1.438751 -0.507314 2.395916
C  3.91905 0.30406 0.136807
C  1.926053 1.623072 0.168932
C  0.291127 -0.853927 -1.092354
C  4.639675 1.406234 -0.310791
C  2.640532 2.722742 -0.279964
C  4.004701 2.619352 -0.523834
C  -2.176731 -0.510826 -0.859231
C  -3.299266 -1.280918 -1.159299
C  -2.28959 0.48768 0.104534
C  -4.61235 -0.093019 0.494812
C  -4.496306 -1.06427 -0.499095
C  -3.487309 0.67298 0.781132
C  -5.912818 0.124641 1.208469
H  3.362212 -2.132538 1.446732
H  1.817346 -2.916368 1.166377
H  2.777928 -2.352402 -0.202202
H  0.878439 0.41991 2.525129
H  2.366654 -0.421999 2.959736
H  0.855663 -1.322424 2.829479
H  -0.369207 -0.794574 0.833777
H  4.44367 -0.629898 0.286262
H  0.86234 1.726296 0.349843
H  5.701185 1.307627 -0.498485
H  2.129688 3.663308 -0.441889
H  4.563712 3.475577 -0.878305
H  -3.231148 -2.053823 -1.915312
H  -1.453083 1.140044 0.322755
H  -5.355099 -1.673881 -0.754665
H  -3.545446 1.447404 1.536586
H  -5.80092 0.819731 2.039538
H  -6.312405 -0.809409 1.605356
H  -6.669733 0.53411 0.536783
H  -1.09139 -1.021853 -2.534091
elementType: O N C H
totalener: -844.70559566 hartree
nucrepener: 1505.36664900 hartree
electener: -2350.07224466 hartree
oneelecener: -4134.62635838 hartree
twoeener: 1784.55411372 hartree
cpcmener: -0.04178611 hartree
kineticenergy: 840.83906424 hartree
xcener: -83.957323086189 hartree
chargesum: 0.0000000
charge: -0.592821 -0.259044 -0.181430 0.409775 -0.061482 -0.343029 -0.320335 -0.166609 -0.230821 0.415566 -0.165705 -0.205508 -0.160138 0.113819 -0.198115 -0.220354 -0.005616 -0.165994 -0.179424 -0.204365 0.099824 0.103894 0.105985 0.113128 0.106287 0.114216 0.184629 0.145428 0.172274 0.158276 0.155362 0.160926 0.148186 0.199532 0.144848 0.141524 0.092539 0.100691 0.102247 0.171834
qa: -0.5928 -0.2590 -0.1814 0.4098 -0.0615 -0.3430 -0.3203 -0.1666 -0.2308 0.4156 -0.1657 -0.2055 -0.1601 0.1138 -0.1981 -0.2204 -0.0056 -0.1660 -0.1794 -0.2044 0.0998 0.1039 0.1060 0.1131 0.1063 0.1142 0.1846 0.1454 0.1723 0.1583 0.1554 0.1609 0.1482 0.1995 0.1448 0.1415 0.0925 0.1007 0.1022 0.1718
va: 1.9051 3.1375 3.1478 3.6334 3.5816 3.9384 3.9157 3.9216 3.9583 4.3355 3.9236 3.9634 3.8804 3.7714 3.9816 3.9416 3.7164 3.9290 3.9663 3.8945 1.0011 1.0115 1.0162 0.9996 1.0051 1.0017 1.0055 1.0016 0.9914 0.9923 0.9940 0.9889 1.0042 0.9719 0.9986 1.0046 1.0046 0.9966 0.9944 1.0209
dispcorr: -0.018874838 hartree
energy: -844.724470499401
dipole: -3.81552 1.86481 -1.95071 -1.40706 1.44506 0.03800 10.85003 -9.04778 1.80224
magnitude: 2.65609 au
magnitude: 6.75123 debye
