program: Orca
programVersion: 5.0.2
elementType: O N N C C C C C C C C C C C C C C C C C H H H H H H H H H H H H H H H H H H H H
charge: 0
multiplicity: 1
keywords: wb97x-d3
keywords: def2-TZVPP
keywords: def2/J RIJCOSX
keywords: DEFGRID2
keywords: scfconv7
keywords: smallprint printgap noloewdin
keywords: NOSOSCF
formula: C17H20N2O
InChI: InChI=1/C17H20N2O/c1-13-9-11-15(12-10-13)18-16(20)19-17(2,3)14-7-5-4-6-8-14/h4-12,18-19H,1-3H3
40 atoms
O  1.249177 -1.073402 -1.903309
N  0.462026 -0.856213 0.215074
N  -0.979927 -0.948057 -1.603188
C  1.760356 -0.733528 0.875459
C  2.505955 0.498599 0.364772
C  2.557315 -2.029407 0.731776
C  1.457961 -0.526772 2.363278
C  3.870853 0.490439 0.099157
C  1.812895 1.699483 0.207219
C  0.310433 -0.959858 -1.123734
C  4.525289 1.645221 -0.31544
C  2.461136 2.851806 -0.207851
C  3.824831 2.830256 -0.47249
C  -2.153965 -0.674965 -0.879703
C  -2.98635 0.36862 -1.280592
C  -2.528166 -1.44583 0.216524
C  -4.506704 -0.084304 0.550434
C  -4.146974 0.648352 -0.58063
C  -3.679214 -1.135858 0.928515
C  -5.742079 0.261077 1.326592
H  1.941673 -2.868638 1.057326
H  2.876703 -2.220482 -0.290436
H  3.44445 -2.014832 1.365488
H  0.916112 -1.382589 2.771101
H  0.858008 0.369096 2.53384
H  2.385008 -0.417113 2.92506
H  -0.338181 -0.58977 0.767908
H  4.445858 -0.419691 0.205226
H  0.747753 1.741235 0.403112
H  5.587684 1.610613 -0.521326
H  1.898836 3.769645 -0.325661
H  4.333126 3.728641 -0.798736
H  -2.716428 0.970106 -2.14065
H  -1.928926 -2.296245 0.517003
H  -4.775679 1.466941 -0.911707
H  -3.940418 -1.740266 1.789178
H  -6.635079 0.217767 0.700812
H  -5.685687 1.274029 1.729921
H  -5.891273 -0.418496 2.1649
H  -1.026436 -0.797507 -2.600895
elementType: O N C H
totalener: -844.71460451 hartree
nucrepener: 1504.93023494 hartree
electener: -2349.64483945 hartree
oneelecener: -4133.65567092 hartree
twoeener: 1784.01083147 hartree
cpcmener: -0.03220796 hartree
kineticenergy: 840.84012939 hartree
xcener: -83.953687918241 hartree
chargesum: 0.0000000
charge: -0.548948 -0.281772 -0.196129 0.429094 -0.039367 -0.345829 -0.317805 -0.183447 -0.232135 0.410079 -0.156146 -0.187742 -0.161960 0.153010 -0.205918 -0.230704 -0.013508 -0.157029 -0.150778 -0.203960 0.103963 0.113468 0.098362 0.113510 0.108417 0.106186 0.183062 0.141055 0.136577 0.154058 0.153555 0.156752 0.145619 0.158716 0.141862 0.141567 0.101691 0.101939 0.090870 0.169769
qa: -0.5489 -0.2818 -0.1961 0.4291 -0.0394 -0.3458 -0.3178 -0.1834 -0.2321 0.4101 -0.1561 -0.1877 -0.1620 0.1530 -0.2059 -0.2307 -0.0135 -0.1570 -0.1508 -0.2040 0.1040 0.1135 0.0984 0.1135 0.1084 0.1062 0.1831 0.1411 0.1366 0.1541 0.1536 0.1568 0.1456 0.1587 0.1419 0.1416 0.1017 0.1019 0.0909 0.1698
va: 1.9655 3.1326 3.1327 3.6473 3.5863 3.9192 3.9109 3.9392 3.9916 4.3508 3.9297 3.9460 3.8937 3.6908 4.0115 3.9693 3.7283 3.9301 3.9215 3.8954 1.0112 1.0174 1.0012 1.0037 1.0011 1.0057 1.0061 1.0040 1.0095 0.9937 0.9932 0.9902 1.0049 1.0071 0.9993 1.0008 0.9956 0.9950 1.0055 1.0228
dispcorr: -0.018553801 hartree
energy: -844.733158313970
dipole: -3.36286 1.57113 -1.79173 -0.18352 0.72087 0.53735 10.94001 -9.32511 1.61490
magnitude: 2.47122 au
magnitude: 6.28134 debye
