program: Orca
programVersion: 5.0.2
elementType: O N C C C C C C C C C C C C C C C C H H H H H H H H H H H H H H H H H
charge: 0
multiplicity: 1
keywords: wb97x-d3
keywords: def2-TZVPP
keywords: def2/J RIJCOSX
keywords: DEFGRID2
keywords: scfconv7
keywords: smallprint printgap noloewdin
keywords: NOSOSCF
formula: C16H17NO
InChI: InChI=1/C16H17NO/c1-17(2)16(18)15(13-9-5-3-6-10-13)14-11-7-4-8-12-14/h3-12,15H,1-2H3
35 atoms
O  -0.062369 2.010368 1.283804
N  1.588263 2.233122 -0.239167
C  0.024471 0.364505 -0.464937
C  -1.442061 0.099068 -0.205623
C  0.873753 -0.848791 -0.132028
C  0.511595 1.613947 0.271345
C  -2.360163 0.315701 -1.228123
C  1.480205 -1.022264 1.108441
C  -1.904284 -0.391066 1.014373
C  1.028564 -1.841293 -1.098141
C  -3.711056 0.047432 -1.044273
C  2.22851 -2.162695 1.374082
C  -3.252456 -0.657414 1.201883
C  1.773405 -2.980507 -0.833924
C  2.074005 3.47621 0.327837
C  2.282843 1.807396 -1.440593
C  -4.161494 -0.440069 0.173065
C  2.379322 -3.143974 0.405282
H  0.120828 0.538851 -1.539288
H  -2.015257 0.69129 -2.184272
H  1.376257 -0.272512 1.88316
H  -1.211097 -0.589861 1.821729
H  0.563456 -1.715649 -2.068883
H  -4.407591 0.215445 -1.855481
H  2.696821 -2.279866 2.342704
H  -3.594963 -1.041364 2.154198
H  1.886067 -3.738199 -1.598556
H  3.091241 3.354048 0.702197
H  2.085321 4.253703 -0.437527
H  1.443818 3.809763 1.144509
H  1.836108 2.233012 -2.341059
H  3.314473 2.149466 -1.383863
H  2.315617 0.726252 -1.538863
H  -5.212041 -0.655146 0.319955
H  2.966409 -4.029123 0.612469
elementType: O N C H
totalener: -749.99391557 hartree
nucrepener: 1274.21368602 hartree
electener: -2024.20760158 hartree
oneelecener: -3546.46049914 hartree
twoeener: 1522.25289756 hartree
cpcmener: -0.03529205 hartree
kineticenergy: 746.57469162 hartree
xcener: -74.682635838015 hartree
chargesum: 0.0000000
charge: -0.561395 -0.103519 0.240338 0.025726 -0.021422 0.257990 -0.201380 -0.166153 -0.221834 -0.221371 -0.168875 -0.183149 -0.179896 -0.155880 -0.174970 -0.183048 -0.159938 -0.160783 0.112103 0.139875 0.144662 0.153615 0.142662 0.159011 0.160173 0.157912 0.160237 0.112442 0.116698 0.102677 0.121899 0.113302 0.120052 0.160539 0.161699
qa: -0.5614 -0.1035 0.2403 0.0257 -0.0214 0.2580 -0.2014 -0.1662 -0.2218 -0.2214 -0.1689 -0.1831 -0.1799 -0.1559 -0.1750 -0.1830 -0.1599 -0.1608 0.1121 0.1399 0.1447 0.1536 0.1427 0.1590 0.1602 0.1579 0.1602 0.1124 0.1167 0.1027 0.1219 0.1133 0.1201 0.1605 0.1617
va: 1.9418 3.2040 3.4751 3.5340 3.5788 4.2154 3.9613 3.8616 3.9554 3.9563 3.9008 3.9433 3.9415 3.8906 3.8790 3.8917 3.8841 3.8888 1.0145 1.0061 1.0187 1.0076 1.0055 0.9918 0.9920 0.9930 0.9903 0.9902 0.9875 1.0276 0.9877 0.9943 0.9902 0.9894 0.9889
dispcorr: -0.016291765 hartree
energy: -750.010207330182
dipole: 6.65188 -5.07631 1.57558 3.60705 -3.78795 -0.18090 -4.12626 2.24824 -1.87802
magnitude: 2.45807 au
magnitude: 6.24793 debye
