program: Orca
programVersion: 5.0.2
elementType: O N C C C C C C C C C C C C C C C C H H H H H H H H H H H H H H H H H
charge: 0
multiplicity: 1
keywords: wb97x-d3
keywords: def2-TZVPP
keywords: def2/J RIJCOSX
keywords: DEFGRID2
keywords: scfconv7
keywords: smallprint printgap noloewdin
keywords: NOSOSCF
formula: C16H17NO
InChI: InChI=1/C16H17NO/c1-17(2)16(18)15(13-9-5-3-6-10-13)14-11-7-4-8-12-14/h3-12,15H,1-2H3
35 atoms
O  -0.05032 1.956795 1.290793
N  1.58159 2.23404 -0.244783
C  0.021643 0.348158 -0.484806
C  -1.44393 0.082386 -0.229834
C  0.878787 -0.858644 -0.152128
C  0.500491 1.592834 0.272887
C  -2.362301 0.278189 -1.253222
C  1.51139 -1.005225 1.077694
C  -1.903638 -0.367615 1.003685
C  1.015897 -1.871756 -1.097678
C  -3.715006 0.037229 -1.05583
C  2.263935 -2.138822 1.352518
C  -3.251964 -0.608041 1.204596
C  1.76774 -3.002729 -0.825643
C  2.049841 3.456336 0.367627
C  2.28568 1.825008 -1.437597
C  -4.163739 -0.404552 0.177182
C  2.396818 -3.139588 0.403485
H  0.122448 0.530792 -1.558803
H  -2.019896 0.626431 -2.221189
H  1.41627 -0.237374 1.835343
H  -1.206661 -0.539026 1.812093
H  0.517946 -1.775756 -2.055667
H  -4.414202 0.195388 -1.866533
H  2.749346 -2.236278 2.314752
H  -3.594786 -0.954495 2.17075
H  1.862152 -3.77871 -1.574036
H  3.078301 3.343212 0.718767
H  2.024869 4.280331 -0.349606
H  1.420473 3.713593 1.212687
H  1.86593 2.268017 -2.346063
H  3.323046 2.150108 -1.362243
H  2.308966 0.743777 -1.550513
H  -5.216922 -0.593406 0.338677
H  2.986357 -4.020825 0.619034
totalener: -749.97878528 hartree
nucrepener: 1275.53622396 hartree
electener: -2025.51500924 hartree
oneelecener: -3548.17213955 hartree
twoeener: 1522.65713031 hartree
kineticenergy: 746.61820591 hartree
xcener: -74.684977168877 hartree
chargesum: -0.0000000
charge: -0.393486 -0.125987 0.120537 0.077719 -0.010919 0.222902 -0.175654 -0.147587 -0.127812 -0.192993 -0.136883 -0.146580 -0.143775 -0.121606 -0.178406 -0.193440 -0.118704 -0.119770 0.085654 0.097631 0.136644 0.115914 0.108948 0.118841 0.126092 0.118830 0.124610 0.092802 0.099507 0.118363 0.110250 0.096791 0.114242 0.121359 0.125967
qa: -0.3935 -0.1260 0.1205 0.0777 -0.0109 0.2229 -0.1757 -0.1476 -0.1278 -0.1930 -0.1369 -0.1466 -0.1438 -0.1216 -0.1784 -0.1934 -0.1187 -0.1198 0.0857 0.0976 0.1366 0.1159 0.1089 0.1188 0.1261 0.1188 0.1246 0.0928 0.0995 0.1184 0.1103 0.0968 0.1142 0.1214 0.1260
va: 2.1237 3.1431 3.6571 3.6307 3.6534 4.2075 4.0052 3.9167 4.0241 4.0231 3.9874 4.0021 3.9857 3.9637 3.8879 3.9080 3.9498 3.9531 1.0131 1.0135 1.0210 1.0174 1.0134 1.0032 1.0023 1.0030 1.0009 0.9919 0.9877 1.0316 0.9857 0.9978 0.9948 1.0004 0.9997
dispcorr: -0.016305382 hartree
energy: -749.995090665991
dipole: 6.59645 -5.59642 1.00004 3.73023 -3.83001 -0.09978 -3.95280 2.98297 -0.96983
magnitude: 1.39664 au
magnitude: 3.54998 debye
