program: Orca
programVersion: 5.0.2
elementType: Cl O N N C C C C C C C C C C C C C C C C C H H H H H H H H H H H H H H H H H H H
charge: 0
multiplicity: 1
keywords: wb97x-d3
keywords: def2-TZVPP
keywords: def2/J RIJCOSX
keywords: DEFGRID2
keywords: scfconv7
keywords: smallprint printgap noloewdin
keywords: NOSOSCF
formula: C17H19ClN2O
InChI: InChI=1/C17H19ClN2O/c1-17(2,14-9-4-3-5-10-14)20-16(21)19-12-13-8-6-7-11-15(13)18/h3-11,19-20H,12H2,1-2H3
40 atoms
Cl -2.043653 -2.771277 -1.187753
O  0.979328 -0.119837 1.887748
N  2.091059 -1.004004 0.112336
N  0.301679 -2.111756 1.032558
C  2.888924 0.180648 -0.198619
C  1.985477 1.387652 -0.452377
C  3.626945 -0.129625 -1.503783
C  3.92476 0.425118 0.898026
C  2.355523 2.676311 -0.081681
C  0.77802 1.220798 -1.132785
C  1.113754 -1.010184 1.050758
C  -1.023651 -2.011253 1.612031
C  1.543682 3.766229 -0.376221
C  -0.035983 2.304397 -1.424137
C  0.343849 3.586397 -1.046072
C  -1.909864 -1.02624 0.88967
C  -2.396756 -1.262878 -0.393953
C  -2.232347 0.195761 1.47467
C  -3.166911 -0.334895 -1.076705
C  -3.001428 1.139949 0.810955
C  -3.466073 0.875251 -0.468452
H  4.289472 -0.98891 -1.383294
H  4.232557 0.723667 -1.805675
H  4.642483 1.189215 0.601062
H  4.485646 -0.492605 1.07442
H  3.474188 0.734211 1.839524
H  2.025144 -1.690296 -0.624371
H  3.283364 2.851169 0.446254
H  0.459885 0.23125 -1.440084
H  0.363345 -2.704184 0.217391
H  -0.946224 -1.726721 2.659861
H  -1.462605 -3.008017 1.599946
H  1.854147 4.758454 -0.07454
H  -0.969924 2.145448 -1.947951
H  -0.289989 4.434243 -1.270702
H  -1.869861 0.404258 2.473284
H  -3.530709 -0.55332 -2.071638
H  -3.232905 2.081578 1.290404
H  -4.065298 1.603682 -0.997974
H  2.927686 -0.346977 -2.313278
elementType: Cl O N C H
totalener: -1304.31631882 hartree
nucrepener: 1851.86325375 hartree
electener: -3156.17957258 hartree
oneelecener: -5462.80932850 hartree
twoeener: 2306.62975593 hartree
cpcmener: -0.04278492 hartree
kineticenergy: 1299.83617623 hartree
xcener: -104.770878245142 hartree
chargesum: -0.0000000
charge: -0.103078 -0.589127 -0.249281 -0.236317 0.406093 0.002210 -0.313405 -0.337881 -0.196552 -0.246510 0.418237 -0.042573 -0.159737 -0.206085 -0.164391 0.053925 0.010025 -0.158411 -0.126662 -0.151271 -0.191244 0.114883 0.102281 0.100497 0.102589 0.110482 0.157469 0.145677 0.142575 0.163059 0.105654 0.138962 0.157559 0.163565 0.160358 0.141392 0.142329 0.160553 0.162190 0.109961
qa: -0.1031 -0.5891 -0.2493 -0.2363 0.4061 0.0022 -0.3134 -0.3379 -0.1966 -0.2465 0.4182 -0.0426 -0.1597 -0.2061 -0.1644 0.0539 0.0100 -0.1584 -0.1267 -0.1513 -0.1912 0.1149 0.1023 0.1005 0.1026 0.1105 0.1575 0.1457 0.1426 0.1631 0.1057 0.1390 0.1576 0.1636 0.1604 0.1414 0.1423 0.1606 0.1622 0.1100
va: 1.2241 1.9113 3.1567 3.1127 3.6612 3.5276 3.9096 3.9139 3.9408 3.9392 4.3373 3.8802 3.9250 3.8997 3.8992 3.4053 3.8739 3.8918 3.9304 3.8729 3.8936 1.0028 1.0052 1.0018 1.0132 1.0161 1.0193 1.0021 1.0121 1.0283 1.0150 0.9996 0.9917 0.9885 0.9894 1.0127 1.0047 0.9893 0.9880 1.0004
dispcorr: -0.023522406 hartree
energy: -1304.339841231014
dipole: 17.01020 -17.01588 -0.00568 12.21365 -12.90453 -0.69088 0.80668 -2.43954 -1.63286
magnitude: 1.77302 au
magnitude: 4.50666 debye
