program: Orca
programVersion: 5.0.2
elementType: Cl O N N C C C C C C C C C C C C C C C C C H H H H H H H H H H H H H H H H H H H
charge: 0
multiplicity: 1
keywords: wb97x-d3
keywords: def2-TZVPP
keywords: def2/J RIJCOSX
keywords: DEFGRID2
keywords: scfconv7
keywords: smallprint printgap noloewdin
keywords: NOSOSCF
formula: C17H19ClN2O
InChI: InChI=1/C17H19ClN2O/c1-17(2,14-9-4-3-5-10-14)20-16(21)19-12-13-8-6-7-11-15(13)18/h3-11,19-20H,12H2,1-2H3
40 atoms
Cl -2.334946 1.2052 0.155345
O  0.966721 -2.831318 -0.620084
N  2.200505 -1.097908 0.141483
N  0.131658 -0.745369 -0.860085
C  2.296703 0.139025 0.924465
C  2.095271 1.357354 0.026617
C  3.727791 0.18774 1.468293
C  1.32789 0.096377 2.108982
C  1.332452 2.451744 0.424338
C  2.708376 1.400001 -1.226945
C  1.07628 -1.619824 -0.440313
C  -1.153124 -1.189564 -1.345442
C  1.184087 3.557746 -0.405217
C  2.562823 2.501883 -2.054305
C  1.796646 3.587635 -1.647326
C  -2.133506 -1.472979 -0.235211
C  -2.717398 -0.454122 0.513766
C  -2.468734 -2.782218 0.097039
C  -3.603634 -0.712993 1.546669
C  -3.353157 -3.064681 1.127696
C  -3.920819 -2.028051 1.852827
H  3.920005 -0.660038 2.130129
H  3.882755 1.100925 2.041811
H  0.282497 0.123716 1.798967
H  1.494586 0.92437 2.798005
H  1.486263 -0.826677 2.667736
H  2.818589 -1.829529 0.462645
H  0.835939 2.457387 1.385018
H  3.296285 0.556001 -1.566207
H  0.25038 0.242851 -0.709633
H  -1.025895 -2.084037 -1.952771
H  -1.542058 -0.418536 -2.010778
H  0.581313 4.394184 -0.074538
H  3.044005 2.511063 -3.024205
H  1.677459 4.446064 -2.295953
H  -2.028289 -3.592969 -0.470298
H  -4.043203 0.101493 2.106907
H  -3.597363 -4.092249 1.36304
H  -4.612886 -2.235046 2.6585
H  4.46332 0.165818 0.663152
elementType: Cl O N C H
totalener: -1304.32364127 hartree
nucrepener: 1831.12149484 hartree
electener: -3135.44513610 hartree
oneelecener: -5420.21238446 hartree
twoeener: 2284.76724835 hartree
cpcmener: -0.02809002 hartree
kineticenergy: 1299.82235218 hartree
xcener: -104.768788641204 hartree
chargesum: 0.0000000
charge: -0.104436 -0.563877 -0.260465 -0.233570 0.420186 -0.034559 -0.306648 -0.340959 -0.227411 -0.216766 0.386127 -0.059557 -0.146583 -0.176128 -0.152211 0.037263 0.025238 -0.138709 -0.147293 -0.161277 -0.158189 0.106230 0.101985 0.092827 0.102439 0.110192 0.150806 0.139322 0.135779 0.189905 0.109441 0.139210 0.157036 0.155842 0.158052 0.141042 0.140487 0.157946 0.158928 0.112358
qa: -0.1044 -0.5639 -0.2605 -0.2336 0.4202 -0.0346 -0.3066 -0.3410 -0.2274 -0.2168 0.3861 -0.0596 -0.1466 -0.1761 -0.1522 0.0373 0.0252 -0.1387 -0.1473 -0.1613 -0.1582 0.1062 0.1020 0.0928 0.1024 0.1102 0.1508 0.1393 0.1358 0.1899 0.1094 0.1392 0.1570 0.1558 0.1581 0.1410 0.1405 0.1579 0.1589 0.1124
va: 1.2263 1.9515 3.0579 3.0924 3.6498 3.6077 3.9027 3.9813 3.9190 3.9961 4.3884 3.8468 3.9025 3.9385 3.9012 3.4724 3.8826 3.9078 3.9825 3.9305 3.9242 1.0031 1.0043 1.0069 1.0032 1.0108 1.0300 1.0095 1.0285 1.0164 1.0229 0.9999 0.9922 0.9927 0.9898 1.0124 1.0056 0.9901 0.9885 1.0034
dispcorr: -0.022672695 hartree
energy: -1304.346313962209
dipole: 14.43145 -14.48049 -0.04904 -0.26739 1.61751 1.35012 5.81676 -4.86524 0.95152
magnitude: 1.65246 au
magnitude: 4.20022 debye
