program: Orca
programVersion: 5.0.2
elementType: Cl O N N C C C C C C C C C C C C C C C C C H H H H H H H H H H H H H H H H H H H
charge: 0
multiplicity: 1
keywords: wb97x-d3
keywords: def2-TZVPP
keywords: def2/J RIJCOSX
keywords: DEFGRID2
keywords: scfconv7
keywords: smallprint printgap noloewdin
keywords: NOSOSCF
formula: C17H19ClN2O
InChI: InChI=1/C17H19ClN2O/c1-17(2,14-9-4-3-5-10-14)20-16(21)19-12-13-8-6-7-11-15(13)18/h3-11,19-20H,12H2,1-2H3
40 atoms
Cl -1.858176 1.132612 1.500785
O  0.867725 -3.056199 -0.330874
N  2.223409 -1.277927 -0.577839
N  0.506838 -1.254817 1.002511
C  2.853671 -0.015966 -0.217527
C  1.851544 1.135517 -0.322425
C  3.944119 0.235197 -1.266184
C  3.517093 -0.120753 1.161507
C  1.918237 2.2498 0.507993
C  0.873625 1.11266 -1.316411
C  1.172884 -1.929312 0.013564
C  -0.79543 -1.736393 1.408264
C  1.040624 3.313749 0.34539
C  -0.004345 2.170262 -1.476976
C  0.076639 3.278713 -0.646882
C  -1.875356 -1.357158 0.426617
C  -2.407133 -0.071606 0.377433
C  -2.329447 -2.276738 -0.514333
C  -3.365322 0.29102 -0.554616
C  -3.28503 -1.931968 -1.456857
C  -3.805499 -0.647305 -1.474789
H  4.446215 1.181484 -1.072041
H  3.520034 0.283193 -2.269366
H  4.117131 0.758779 1.394475
H  4.18683 -0.980954 1.168932
H  2.791796 -0.261359 1.962128
H  2.726752 -1.870617 -1.217008
H  2.657735 2.304023 1.295558
H  0.789796 0.249092 -1.963213
H  0.618881 -0.254207 1.054674
H  -1.012324 -1.332369 2.397103
H  -0.749936 -2.818564 1.508239
H  1.110262 4.168398 1.005384
H  -0.763086 2.120383 -2.246742
H  -0.613471 4.102877 -0.766993
H  -1.905677 -3.272257 -0.509727
H  -3.762061 1.297003 -0.557702
H  -3.619145 -2.665469 -2.178523
H  -4.553895 -0.369258 -2.204706
H  4.697556 -0.555762 -1.242505
totalener: -1304.29659674 hartree
nucrepener: 1876.93690000 hartree
electener: -3181.23349674 hartree
oneelecener: -5511.52648239 hartree
twoeener: 2330.29298565 hartree
kineticenergy: 1299.88604703 hartree
xcener: -104.778391144412 hartree
chargesum: 0.0000000
charge: -0.093327 -0.445860 -0.240667 -0.222384 0.287497 -0.010856 -0.292562 -0.320956 -0.159231 -0.205482 0.380328 -0.069627 -0.121925 -0.151987 -0.113432 0.010044 0.034903 -0.090973 -0.157246 -0.133501 -0.118601 0.093363 0.113712 0.082719 0.100771 0.115066 0.135535 0.119478 0.129595 0.151193 0.124239 0.106277 0.124712 0.123957 0.122551 0.126031 0.116135 0.127397 0.125728 0.097388
qa: -0.0933 -0.4459 -0.2407 -0.2224 0.2875 -0.0109 -0.2926 -0.3210 -0.1592 -0.2055 0.3803 -0.0696 -0.1219 -0.1520 -0.1134 0.0100 0.0349 -0.0910 -0.1572 -0.1335 -0.1186 0.0934 0.1137 0.0827 0.1008 0.1151 0.1355 0.1195 0.1296 0.1512 0.1242 0.1063 0.1247 0.1240 0.1226 0.1260 0.1161 0.1274 0.1257 0.0974
va: 1.2384 2.0838 3.0506 3.0876 3.8289 3.6090 3.8974 3.9284 3.9872 4.0047 4.3478 3.9049 3.9724 3.9467 3.9320 3.5300 3.9098 3.9459 4.0102 3.9779 3.9537 1.0097 1.0036 1.0079 1.0153 1.0134 1.0452 1.0095 1.0280 1.0504 1.0032 1.0222 1.0017 1.0039 1.0008 1.0238 1.0127 0.9999 0.9979 1.0053
dispcorr: -0.024552942 hartree
energy: -1304.321149678652
dipole: 16.64582 -16.30446 0.34136 0.24968 0.85430 1.10398 -5.59849 5.38191 -0.21658
magnitude: 1.17567 au
magnitude: 2.98832 debye
