program: Orca
programVersion: 5.0.2
elementType: Cl O N N C C C C C C C C C C C C C C C C C H H H H H H H H H H H H H H H H H H H
charge: 0
multiplicity: 1
keywords: wb97x-d3
keywords: def2-TZVPP
keywords: def2/J RIJCOSX
keywords: DEFGRID2
keywords: scfconv7
keywords: smallprint printgap noloewdin
keywords: NOSOSCF
formula: C17H19ClN2O
InChI: InChI=1/C17H19ClN2O/c1-17(2,14-9-4-3-5-10-14)20-16(21)19-12-13-8-6-7-11-15(13)18/h3-11,19-20H,12H2,1-2H3
40 atoms
Cl -2.27847 1.178961 -0.520706
O  0.797012 -2.70681 1.102178
N  2.151275 -1.096766 0.2608
N  0.025264 -0.583434 1.06116
C  2.29217 -0.004998 -0.703764
C  2.073311 1.340325 -0.015517
C  1.371919 -0.21993 -1.911071
C  3.746471 -0.041681 -1.186637
C  1.373897 2.380329 -0.619104
C  2.621421 1.559015 1.248606
C  0.962489 -1.536798 0.812544
C  -1.311626 -0.958742 1.442346
C  1.231942 3.607563 0.016793
C  2.48365 2.781989 1.882027
C  1.788711 3.814662 1.266767
C  -2.138236 -1.412781 0.266355
C  -2.616768 -0.519236 -0.686666
C  -2.409387 -2.76279 0.072473
C  -3.352457 -0.93675 -1.782973
C  -3.143476 -3.202177 -1.017801
C  -3.616638 -2.287621 -1.945228
H  1.537341 -1.218063 -2.316836
H  1.577489 0.492984 -2.709988
H  3.960248 -0.976828 -1.710061
H  4.442471 0.053945 -0.353462
H  3.937234 0.777675 -1.87795
H  2.753879 -1.884547 0.076527
H  0.918453 2.243455 -1.590049
H  3.144039 0.75188 1.745609
H  0.201225 0.382082 0.844797
H  -1.776608 -0.0995 1.926188
H  -1.266198 -1.755144 2.183817
H  0.67867 4.399847 -0.47024
H  2.914544 2.928501 2.863759
H  1.676757 4.769539 1.763136
H  -2.019692 -3.475508 0.787288
H  -3.713388 -0.212901 -2.500548
H  -3.339579 -4.258229 -1.145483
H  -4.190041 -2.620096 -2.800065
H  0.316833 -0.140439 -1.650341
totalener: -1304.29718195 hartree
nucrepener: 1839.68113161 hartree
electener: -3143.97831356 hartree
oneelecener: -5436.87591385 hartree
twoeener: 2292.89760028 hartree
kineticenergy: 1299.88417373 hartree
xcener: -104.775836429725 hartree
chargesum: -0.0000000
charge: -0.098207 -0.436885 -0.259153 -0.234898 0.349594 -0.034814 -0.314143 -0.290614 -0.217869 -0.182305 0.354275 -0.073274 -0.110415 -0.147001 -0.114636 0.029361 0.007631 -0.087168 -0.124695 -0.128404 -0.129623 0.105199 0.087011 0.092379 0.111311 0.094385 0.132848 0.120810 0.123360 0.173813 0.127869 0.105175 0.126834 0.127151 0.126821 0.121093 0.117819 0.127465 0.126509 0.095392
qa: -0.0982 -0.4369 -0.2592 -0.2349 0.3496 -0.0348 -0.3141 -0.2906 -0.2179 -0.1823 0.3543 -0.0733 -0.1104 -0.1470 -0.1146 0.0294 0.0076 -0.0872 -0.1247 -0.1284 -0.1296 0.1052 0.0870 0.0924 0.1113 0.0944 0.1328 0.1208 0.1234 0.1738 0.1279 0.1052 0.1268 0.1272 0.1268 0.1211 0.1178 0.1275 0.1265 0.0954
va: 1.2357 2.0898 3.0198 3.0820 3.7573 3.6533 3.9668 3.9057 3.9734 4.0384 4.3923 3.9030 3.9707 3.9967 3.9588 3.5126 3.9271 3.9525 4.0141 3.9708 3.9710 1.0152 1.0061 1.0062 1.0056 1.0087 1.0434 1.0161 1.0357 1.0284 0.9992 1.0218 1.0013 1.0018 0.9995 1.0218 1.0121 0.9997 0.9987 1.0147
dispcorr: -0.023091876 hartree
energy: -1304.320273828955
dipole: 14.62087 -14.50965 0.11122 -1.17421 1.96270 0.78849 -4.49274 3.76460 -0.72814
magnitude: 1.07902 au
magnitude: 2.74264 debye
