program: Orca
programVersion: 5.0.2
elementType: Cl O N N C C C C C C C C C C C C C C C C C H H H H H H H H H H H H H H H H H H H
charge: 0
multiplicity: 1
keywords: wb97x-d3
keywords: def2-TZVPP
keywords: def2/J RIJCOSX
keywords: DEFGRID2
keywords: scfconv7
keywords: smallprint printgap noloewdin
keywords: NOSOSCF
formula: C17H19ClN2O
InChI: InChI=1/C17H19ClN2O/c1-17(2,14-9-4-3-5-10-14)20-16(21)19-12-13-8-6-7-11-15(13)18/h3-11,19-20H,12H2,1-2H3
40 atoms
Cl -2.327751 1.1810 0.1058
O  0.9409 -2.829376 -0.612035
N  2.172202 -1.076766 0.12583
N  0.137657 -0.746143 -0.960284
C  2.195003 0.14918 0.925143
C  2.033534 1.369008 0.020541
C  3.588459 0.225229 1.560833
C  1.153833 0.089764 2.048167
C  1.23465 2.454131 0.36561
C  2.729359 1.418734 -1.187933
C  1.057568 -1.625464 -0.480157
C  -1.153467 -1.210067 -1.399154
C  1.137745 3.561858 -0.467845
C  2.63724 2.523037 -2.017182
C  1.839542 3.60223 -1.660066
C  -2.081555 -1.496947 -0.245683
C  -2.656873 -0.478606 0.508059
C  -2.352035 -2.806863 0.134865
C  -3.481037 -0.739915 1.589886
C  -3.174233 -3.09044 1.213956
C  -3.740804 -2.055321 1.940724
H  3.753926 -0.615976 2.2387
H  3.691434 1.143002 2.137832
H  1.260808 0.921852 2.744716
H  1.29222 -0.829579 2.617446
H  0.131231 0.093569 1.671499
H  2.761914 -1.811889 0.485646
H  0.664717 2.445174 1.284281
H  3.331581 0.570796 -1.488233
H  0.274963 0.245358 -0.867074
H  -1.028923 -2.110967 -1.99816
H  -1.579718 -0.448936 -2.052894
H  0.504263 4.390701 -0.18028
H  3.182352 2.538333 -2.951924
H  1.761242 4.462533 -2.311512
H  -1.890248 -3.611761 -0.421752
H  -3.914723 0.077042 2.149919
H  -3.366542 -4.118568 1.489399
H  -4.383913 -2.265051 2.784902
H  4.371619 0.216082 0.802829
totalener: -1304.29700187 hartree
nucrepener: 1841.89888604 hartree
electener: -3146.19588791 hartree
oneelecener: -5441.30096307 hartree
twoeener: 2295.10507517 hartree
kineticenergy: 1299.87787986 hartree
xcener: -104.774785695122 hartree
chargesum: -0.0000000
charge: -0.097896 -0.436823 -0.258748 -0.234554 0.355540 -0.035616 -0.291444 -0.312435 -0.221912 -0.181938 0.352672 -0.070811 -0.109113 -0.145466 -0.115880 0.025542 0.009056 -0.089524 -0.122437 -0.126320 -0.131207 0.092900 0.094496 0.087170 0.104732 0.092154 0.133273 0.120599 0.122368 0.172878 0.105268 0.128072 0.127224 0.127014 0.127165 0.121337 0.117915 0.127715 0.126139 0.110893
qa: -0.0979 -0.4368 -0.2587 -0.2346 0.3555 -0.0356 -0.2914 -0.3124 -0.2219 -0.1819 0.3527 -0.0708 -0.1091 -0.1455 -0.1159 0.0255 0.0091 -0.0895 -0.1224 -0.1263 -0.1312 0.0929 0.0945 0.0872 0.1047 0.0922 0.1333 0.1206 0.1224 0.1729 0.1053 0.1281 0.1272 0.1270 0.1272 0.1213 0.1179 0.1277 0.1261 0.1109
va: 1.2366 2.0895 3.0231 3.0822 3.7523 3.6514 3.9057 3.9687 3.9707 4.0446 4.3942 3.9018 3.9678 3.9960 3.9600 3.5169 3.9267 3.9544 4.0113 3.9692 3.9734 1.0061 1.0087 1.0062 1.0155 1.0157 1.0434 1.0168 1.0362 1.0294 1.0220 0.9993 1.0014 1.0018 0.9995 1.0216 1.0119 0.9996 0.9989 1.0056
dispcorr: -0.023205248 hartree
energy: -1304.320207115818
dipole: 13.98727 -13.97305 0.01423 -0.15621 1.04623 0.89002 6.13010 -5.50162 0.62848
magnitude: 1.08964 au
magnitude: 2.76966 debye
